{"text_format":"1","workbook":"xlsx","n_sheets":6,"sheets":["Application V2","Instructions.","Application.","List Box Sources","Presentation Outline.","Notes for programming"],"not_rendered":{"charts":0,"images":3,"macros":1,"external_links":1,"defined_names":6,"comments":0,"pivot_tables":0},"unopened":[],"bounds":{"document_bytes":16777216,"sheet_cells":100000,"rows_first":2000,"rows_last":500,"rows_between":2000,"halvings":0,"cell_chars":16384,"cell_head_chars":4096},"cells_cut":0,"cells_raw":0,"read":"whole","date_system":"1900"}

{"sheet":"Application V2","index":0,"n_rows":583,"n_cols":17,"rows_kept":583,"cut":false,"hidden":true,"merged":[[374,5,374,6],[347,5,347,6],[348,5,348,6],[375,5,375,6],[386,5,386,6],[387,5,387,6],[388,5,388,6],[351,5,351,6],[352,5,352,6],[353,5,353,6],[363,5,363,6],[238,5,238,6],[243,5,243,6],[247,5,247,6],[152,5,152,6],[153,5,153,6],[154,5,154,6],[223,5,223,6],[231,5,231,6],[242,5,242,6],[519,5,519,6],[275,5,275,6],[303,5,303,6],[451,5,451,6],[331,5,331,6],[164,5,164,6],[169,5,169,6],[173,5,173,6],[191,5,191,6],[192,5,192,6],[193,5,193,6],[201,5,201,6],[202,5,202,6],[203,5,203,6],[204,5,204,6],[215,5,215,6],[216,5,216,6],[217,5,217,6],[211,5,211,6],[494,5,494,6],[212,5,212,6],[408,5,408,6],[409,5,409,6],[205,5,205,6],[135,5,135,6],[136,5,136,6],[137,5,137,6],[139,5,139,6],[149,5,149,6],[88,5,88,6],[94,5,94,6],[95,5,95,6],[96,5,96,6],[97,5,97,6],[118,5,118,6],[119,5,119,6],[120,5,120,6],[123,5,123,6],[125,5,125,6],[130,5,130,6],[134,5,134,6],[127,5,127,6],[128,5,128,6],[131,5,131,6],[141,5,141,6],[144,5,144,6],[145,5,145,6],[148,5,148,6],[0,5,0,6],[82,5,82,6],[62,5,62,6],[3,5,3,6],[4,5,4,6],[2,5,2,6],[11,5,11,6],[20,5,20,6],[46,5,46,6],[63,5,63,6],[64,5,64,6],[65,5,65,6],[66,5,66,6],[74,5,74,6],[19,5,19,6],[16,5,16,6],[57,5,57,6],[411,5,411,6],[415,5,415,6],[398,5,398,6],[399,5,399,6],[400,5,400,6],[389,5,389,6],[390,5,390,6],[393,5,393,6],[394,5,394,6],[432,5,432,6],[436,5,436,6],[437,5,437,6],[442,5,442,6],[416,5,416,6],[417,5,417,6],[418,5,418,6],[425,5,425,6],[427,5,427,6],[433,5,433,6],[438,5,438,6],[500,5,500,6],[511,5,511,6],[512,5,512,6],[477,5,477,6],[479,5,479,6],[495,5,495,6],[496,5,496,6],[497,5,497,6],[454,5,454,6],[455,5,455,6],[456,5,456,6],[462,5,462,6],[476,5,476,6],[581,5,581,6],[571,5,571,6],[572,5,572,6],[574,5,574,6],[575,5,575,6],[576,5,576,6],[552,5,552,6],[555,5,555,6],[556,5,556,6],[559,5,559,6],[561,5,561,6],[538,5,538,6],[112,5,112,6],[113,5,113,6],[114,5,114,6],[101,5,101,6],[102,5,102,6],[103,5,103,6],[111,5,111,6],[578,5,578,6],[537,5,537,6],[546,5,546,6],[547,5,547,6],[548,5,548,6],[549,5,549,6],[527,5,527,6],[528,5,528,6],[529,5,529,6],[244,5,244,6],[245,5,245,6],[522,5,522,6],[523,5,523,6],[524,5,524,6],[498,5,498,6],[499,5,499,6]]}
["Row #","Required Interior","reported interior","Required Exterior","reported exterior","Capability  (Select '+' on the left to see questions)",null,"\n \n \n \n \n Brief Answer for QPL","Hide   True/ False from check boxes","Hide. Converts \"True/False\" to \"Yes/No\" or copies text when checkboxes not used. Column J is data for QPL","Reference \nFile Number(s), Page(s), Section(s)","Applicant accept DLC Proposal (Y/N)?","Status  i=internal\nn=no p=propose\nq=qstn\ny=yes","DLC Reviewer: \ncomment, question, proposal","DLC Reviewer:\nnotes","Action","Vlookup"]
[2,"I  ","   ","E ","    ","1)","Networking of Luminaires and Devices",null,null,null,null,null,null,null,null,2,{"$f":"IF(ISNA(MATCH(A2, Application.!A:A, 0)), \"\", MATCH(A2, Application.!A:A, 0))","v":2}]
[3,"\n \n  \n  \n  ","\n \n  \n  \n  ","\n \n  \n  \n  ","\n \n  \n  \n  ","Definition:  The capability of individual luminaires and control devices to exchange digital data with other luminaires and control devices on the system. This capability is required at the room, space, or area level, but not at the whole building level or beyond (e.g.  non-lighting systems, or the internet).",null,null,null,null,null,null,null,null,null,3,{"$f":"IF(ISNA(MATCH(A3, Application.!A:A, 0)), \"\", MATCH(A3, Application.!A:A, 0))","v":3}]
[4,"I \n ","  \n ","\n E\n ","   \n ","Can individual luminaires and control devices exchange digital data with other luminaires and control devices on the system, at the room or space level?  ",null,null,true,{"$f":"IF(I4=TRUE,\"Yes\", \"No\")","v":"Yes"},"05-Brochure, Pages 6 & 7",null,"y",null,null,4,{"$f":"IF(ISNA(MATCH(A4, Application.!A:A, 0)), \"\", MATCH(A4, Application.!A:A, 0))","v":4}]
[5," \n  \n \n "," \n  \n \n "," \n  \n \n "," \n  \n \n ","What are the size limitations of the data communication system, in terms of number of devices recommended for optimal performance? (answer with a number, or NA)",null,null,null,null,null,null,null,null,null,5,{"$f":"IF(ISNA(MATCH(A5, Application.!A:A, 0)), \"\", MATCH(A5, Application.!A:A, 0))","v":5}]
[6,"  ","i ","   "," e",null,"# of gateways per network",64,null,{"$f":"H6","v":64},"04-Lutron System Rules, Page 8, General System Rules #4 & 5",null,"y",null,null,"",{"$f":"IF(ISNA(MATCH(A6, Application.!A:A, 0)), \"\", MATCH(A6, Application.!A:A, 0))","v":6}]
[7,"  ","i ","   "," e",null,"# of devices per gateway",700,null,700,"04-Lutron System Rules, Page 8, General System Rules",null,"y",null,null,"",{"$f":"IF(ISNA(MATCH(A7, Application.!A:A, 0)), \"\", MATCH(A7, Application.!A:A, 0))","v":7}]
[8,"  ","i ","   "," e",null,"# of devices per network",{"$f":"H7*H6","v":44800},null,44800,"04-Lutron System Rules, Page 8, General System Rules",null,"y","=64*700",null,6,{"$f":"IF(ISNA(MATCH(A8, Application.!A:A, 0)), \"\", MATCH(A8, Application.!A:A, 0))","v":8}]
[9,"  ","i ","   "," e",null,"# of devices per on-premise system ",{"$f":"H8","v":44800},null,44800,"04-Lutron System Rules, Page 8, General System Rules",null,"y","=64*700",null,7,{"$f":"IF(ISNA(MATCH(A9, Application.!A:A, 0)), \"\", MATCH(A9, Application.!A:A, 0))","v":9}]
[10,"  ","i ","   "," e",null,"# of devices per cloud system",0,null,0,null,null,null,null,null,8,{"$f":"IF(ISNA(MATCH(A10, Application.!A:A, 0)), \"\", MATCH(A10, Application.!A:A, 0))","v":10}]
[11,"  ","i ","   "," e",null,"Notes if needed (e.g. aries by wired/wireless or interior/exterior?)",null,null,0,null,null,null,null,null,9,{"$f":"IF(ISNA(MATCH(A11, Application.!A:A, 0)), \"\", MATCH(A11, Application.!A:A, 0))","v":11}]
[12,"  ","i ","   "," e","What is the maximum recommended distance between components?",null,null,null,null,null,null,null,null,null,10,{"$f":"IF(ISNA(MATCH(A12, Application.!A:A, 0)), \"\", MATCH(A12, Application.!A:A, 0))","v":12}]
[13,"  ","i ","   "," e\n ",null,"Distance between wireless nodes, typical interior obstructions (feet)","30 feet for local fixture or zone controls, 71 feet to wireless hub",null,{"$f":"H13","v":"30 feet for local fixture or zone controls, 71 feet to wireless hub"},"04-Lutron System Rules, Page 8, General System Rules #4 & 5",null,"y",null,null,11,{"$f":"IF(ISNA(MATCH(A13, Application.!A:A, 0)), \"\", MATCH(A13, Application.!A:A, 0))","v":13}]
[14,"  ","i ","   "," e",null,"Distance between wireless nodes, clear line of sight (feet)","60 feet for local fixture or zone controls, 71 feet to wireless hub",null,{"$f":"H14","v":"60 feet for local fixture or zone controls, 71 feet to wireless hub"},"04-Lutron System Rules, Page 8, General System Rules #4 & 6",null,"y",null,null,12,{"$f":"IF(ISNA(MATCH(A14, Application.!A:A, 0)), \"\", MATCH(A14, Application.!A:A, 0))","v":14}]
[15,"  ","i ","   "," e",null,"Distance between wired nodes (feet)","330 ft (100 m)",null,"330 ft (100 m)","02p10: \"Wiring distance for any single link segment is 330 ft (100 m) max; use Lutron-provided or 3rd party Ethernet switches for longer distances (see page 3).\"",null,"Y",null,"02p10: \"Wiring distance for any single link segment is 330 ft (100 m) max; use Lutron-provided or 3rd party Ethernet switches for longer distances (see page 3).\"",13,{"$f":"IF(ISNA(MATCH(A15, Application.!A:A, 0)), \"\", MATCH(A15, Application.!A:A, 0))","v":15}]
[16,"  ","i ","   "," e",null,"Notes if needed",null,null,0,null,null,null,null,null,14,{"$f":"IF(ISNA(MATCH(A16, Application.!A:A, 0)), \"\", MATCH(A16, Application.!A:A, 0))","v":16}]
[17,"  \n \n","i \n \n","   \n \n"," e","Is control communication to edge devices (luminaires, sensors) wired, wireless or both?",null,"Select all that apply",null,null,null,null,null,null,null,15,{"$f":"IF(ISNA(MATCH(A17, Application.!A:A, 0)), \"\", MATCH(A17, Application.!A:A, 0))","v":17}]
[18,"  ","i ","   "," e",null,"Wired",null,false,{"$f":"IF(I18=TRUE,\"Yes\", \"No\")","v":"No"},null,null,null,null,null,16,{"$f":"IF(ISNA(MATCH(A18, Application.!A:A, 0)), \"\", MATCH(A18, Application.!A:A, 0))","v":25}]
[19,"  ","i ","   "," e",null,"Wireless",null,true,{"$f":"IF(I19=TRUE,\"Yes\", \"No\")","v":"Yes"},"05-Brochure, Pages 6 & 7",null,"y",null,null,17,{"$f":"IF(ISNA(MATCH(A19, Application.!A:A, 0)), \"\", MATCH(A19, Application.!A:A, 0))","v":26}]
[20,"  ","i\n ","   "," e","Describe briefly how networking software and firmware is upgraded. ",null,"A file can be dowloaded from Lutron website.  The GUI on the HUB will walk user through update process.",null,"A file can be dowloaded from Lutron website.  The GUI on the HUB will walk user through update process.","01-Programming Guide, Page 36, #1 thru 5",null,"y",null,null,18,{"$f":"IF(ISNA(MATCH(A20, Application.!A:A, 0)), \"\", MATCH(A20, Application.!A:A, 0))","v":27}]
[21,"   \n \n \n","   \n \n \n","   \n \n \n","   \n \n \n","What standards and/or protocols does the communication comply with? (not including required regulatory communication standards  such as FCC and IC). ",null,"Select all that apply",null,null,null,null,null,null,null,23,{"$f":"IF(ISNA(MATCH(A21, Application.!A:A, 0)), \"\", MATCH(A21, Application.!A:A, 0))","v":28}]
[22,"  ","i ","   "," e",null,"3GPP",null,false,{"$f":"IF(I22=TRUE,\"Yes\", \"No\")","v":"No"},null,null,null,null,null,24,{"$f":"IF(ISNA(MATCH(A22, Application.!A:A, 0)), \"\", MATCH(A22, Application.!A:A, 0))","v":29}]
[23,"  ","i ","   "," e",null,"3GPP2",null,false,"No",null,null,null,null,null,25,{"$f":"IF(ISNA(MATCH(A23, Application.!A:A, 0)), \"\", MATCH(A23, Application.!A:A, 0))","v":30}]
[24,"  ","i ","   "," e",null,"4G",null,false,"No",null,null,null,null,null,"",{"$f":"IF(ISNA(MATCH(A24, Application.!A:A, 0)), \"\", MATCH(A24, Application.!A:A, 0))","v":32}]
[25,"  ","i ","   "," e",null,"AES-128 encryption",null,true,"Yes","02-Hub Spec Submittal, Page 8, Vive Security Statement #5",null,"y",null,null,"",{"$f":"IF(ISNA(MATCH(A25, Application.!A:A, 0)), \"\", MATCH(A25, Application.!A:A, 0))","v":22}]
[26,"  ","i ","   "," e",null,"BACnet ISO 16484-5:2014  IP",null,true,"Yes","14-BACnet PICS",null,"y","14p2: \"BACnet / IP Annex J\"",null,"",{"$f":"IF(ISNA(MATCH(A26, Application.!A:A, 0)), \"\", MATCH(A26, Application.!A:A, 0))","v":31}]
[27,"  ","i ","   "," e",null,"BACnet ISO 16484-5:2014  ARCNET",null,false,"No",null,null,null,null,null,"",{"$f":"IF(ISNA(MATCH(A27, Application.!A:A, 0)), \"\", MATCH(A27, Application.!A:A, 0))","v":""}]
[28,"  ","i ","   "," e",null,"BACnet ISO 16484-5:2014  MS/TP",null,false,"No",null,null,null,null,null,"",{"$f":"IF(ISNA(MATCH(A28, Application.!A:A, 0)), \"\", MATCH(A28, Application.!A:A, 0))","v":33}]
[29,"  ","i ","   "," e",null,"BlueTooth BLE V4.0",null,false,"No",null,null,null,null,null,31,{"$f":"IF(ISNA(MATCH(A29, Application.!A:A, 0)), \"\", MATCH(A29, Application.!A:A, 0))","v":34}]
[30,"  ","i ","   "," e",null,"DALI",null,false,"No",null,null,null,null,null,34,{"$f":"IF(ISNA(MATCH(A30, Application.!A:A, 0)), \"\", MATCH(A30, Application.!A:A, 0))","v":36}]
[31,"  ","i ","   "," e",null,"DALI2",null,false,"No",null,null,null,null,null,35,{"$f":"IF(ISNA(MATCH(A31, Application.!A:A, 0)), \"\", MATCH(A31, Application.!A:A, 0))","v":37}]
[32,"  ","i ","   "," e",null,"enOcean ISO/IEC 14543-3-10:2012",null,false,"No",null,null,null,null,null,36,{"$f":"IF(ISNA(MATCH(A32, Application.!A:A, 0)), \"\", MATCH(A32, Application.!A:A, 0))","v":39}]
[33,"  ","i ","   "," e",null,"Ethernet IEEE 802.3",null,false,"No",null,null,null,null,null,"",{"$f":"IF(ISNA(MATCH(A33, Application.!A:A, 0)), \"\", MATCH(A33, Application.!A:A, 0))","v":40}]
[34,"  ","i ","   "," e",null,"IEEE 802.15.4-2011",null,false,{"$f":"IF(I34=TRUE,\"Yes\", \"No\")","v":"No"},null,null,null,null,null,"",{"$f":"IF(ISNA(MATCH(A34, Application.!A:A, 0)), \"\", MATCH(A34, Application.!A:A, 0))","v":41}]
[35,"  ","i ","   "," e",null,"Internet TCP/IP",null,false,"No",null,null,null,null,null,"",{"$f":"IF(ISNA(MATCH(A35, Application.!A:A, 0)), \"\", MATCH(A35, Application.!A:A, 0))","v":42}]
[36,"  ","i ","   "," e",null,"Internet IPv4",null,false,"No",null,null,null,null,null,38,{"$f":"IF(ISNA(MATCH(A36, Application.!A:A, 0)), \"\", MATCH(A36, Application.!A:A, 0))","v":43}]
[37,"  ","i ","   "," e",null,"Internet IPv6",null,false,"No",null,null,null,null,null,39,{"$f":"IF(ISNA(MATCH(A37, Application.!A:A, 0)), \"\", MATCH(A37, Application.!A:A, 0))","v":44}]
[38,"  ","i ","   "," e",null,"Internet 6LoWPAN RFC 4944",null,false,"No",null,null,null,null,null,40,{"$f":"IF(ISNA(MATCH(A38, Application.!A:A, 0)), \"\", MATCH(A38, Application.!A:A, 0))","v":45}]
[39,"  ","i ","   "," e",null,"KNX",null,false,"No",null,null,null,null,null,43,{"$f":"IF(ISNA(MATCH(A39, Application.!A:A, 0)), \"\", MATCH(A39, Application.!A:A, 0))","v":46}]
[40,"  ","i ","   "," e",null,"Proprietary",null,true,"Yes","For EcoSystem \"http://www.lutron.com/TechnicalDocumentLibrary/369821_Lutron_Residential_and_Commerical_System_Rules.pdf#PAGE=2\", for Clear Connect \"http://www.lutron.com/TechnicalDocumentLibrary/Clear%20Connect%20Technology%20whitepaper.pdf\"",null,"y","04p2, ",null,44,{"$f":"IF(ISNA(MATCH(A40, Application.!A:A, 0)), \"\", MATCH(A40, Application.!A:A, 0))","v":47}]
[41,"  ","i ","   "," e",null,"Wi-Fi IEEE 802.11",null,true,"Yes","02-Hub Spec Submittal, Page 2",null,"y","02p2: \"Wi-Fi. 2.4 GHz 802.11b / g.\"",null,"",{"$f":"IF(ISNA(MATCH(A41, Application.!A:A, 0)), \"\", MATCH(A41, Application.!A:A, 0))","v":48}]
[42,"  ","i ","   "," e",null,"Zigbee 2.0",null,false,"No",null,null,null,null,null,45,{"$f":"IF(ISNA(MATCH(A42, Application.!A:A, 0)), \"\", MATCH(A42, Application.!A:A, 0))","v":49}]
[43,"  ","i ","   "," e",null,"Zigbee HA Home Automation",null,false,{"$f":"IF(I43=TRUE,\"Yes\", \"No\")","v":"No"},null,null,null,null,null,46,{"$f":"IF(ISNA(MATCH(A43, Application.!A:A, 0)), \"\", MATCH(A43, Application.!A:A, 0))","v":50}]
[44,"  ","i ","   "," e",null,"Zigbee LL Light Link",null,false,{"$f":"IF(I44=TRUE,\"Yes\", \"No\")","v":"No"},null,null,null,null,null,47,{"$f":"IF(ISNA(MATCH(A44, Application.!A:A, 0)), \"\", MATCH(A44, Application.!A:A, 0))","v":51}]
[45,"  ","i ","   "," e",null,"Zigbee 3.0",null,false,{"$f":"IF(I45=TRUE,\"Yes\", \"No\")","v":"No"},null,null,null,null,null,48,{"$f":"IF(ISNA(MATCH(A45, Application.!A:A, 0)), \"\", MATCH(A45, Application.!A:A, 0))","v":52}]
[46,"  ","i ","   "," e",null,"Other (explain)",null,null,{"$f":"H46","v":0},null,null,null,null,null,49,{"$f":"IF(ISNA(MATCH(A46, Application.!A:A, 0)), \"\", MATCH(A46, Application.!A:A, 0))","v":53}]
[47,"  \n ","  \n ","  \n ","  \n ","For the following standards, is the product tested and certified for compliance, and listed in the respective certified products database?",null,"Select all that apply",null,null,null,null,null,null,null,"",{"$f":"IF(ISNA(MATCH(A47, Application.!A:A, 0)), \"\", MATCH(A47, Application.!A:A, 0))","v":54}]
[48,"  ","i ","   "," e",null,"BACnet ISO 16484-5:2014  IP",null,false,{"$f":"IF(I48=TRUE,\"Yes\", \"No\")","v":"No"},null,null,null,null,null,"",{"$f":"IF(ISNA(MATCH(A48, Application.!A:A, 0)), \"\", MATCH(A48, Application.!A:A, 0))","v":55}]
[49,"  ","i ","   "," e",null,"BACnet ISO 16484-5:2014  ARCNET",null,false,"No",null,null,null,null,null,"",{"$f":"IF(ISNA(MATCH(A49, Application.!A:A, 0)), \"\", MATCH(A49, Application.!A:A, 0))","v":56}]
[50,"  ","i ","   "," e",null,"BACnet ISO 16484-5:2014  MS/TP",null,false,"No",null,null,null,null,null,"",{"$f":"IF(ISNA(MATCH(A50, Application.!A:A, 0)), \"\", MATCH(A50, Application.!A:A, 0))","v":57}]
[51,"  ","i ","   "," e",null,"DALI",null,false,"No",null,null,null,null,null,"",{"$f":"IF(ISNA(MATCH(A51, Application.!A:A, 0)), \"\", MATCH(A51, Application.!A:A, 0))","v":58}]
[52,"  ","i ","   "," e",null,"DALI2",null,false,"No",null,null,null,null,null,"",{"$f":"IF(ISNA(MATCH(A52, Application.!A:A, 0)), \"\", MATCH(A52, Application.!A:A, 0))","v":59}]
[53,"  ","i ","   "," e",null,"Zigbee2.0",null,false,"No",null,null,null,null,null,"",{"$f":"IF(ISNA(MATCH(A53, Application.!A:A, 0)), \"\", MATCH(A53, Application.!A:A, 0))","v":60}]
[54,"  ","i ","   "," e",null,"Zigbee HA",null,false,"No",null,null,null,null,null,"",{"$f":"IF(ISNA(MATCH(A54, Application.!A:A, 0)), \"\", MATCH(A54, Application.!A:A, 0))","v":62}]
[55,"  ","i ","   "," e",null,"Zigbee Light Link",null,false,"No",null,null,null,null,null,"",{"$f":"IF(ISNA(MATCH(A55, Application.!A:A, 0)), \"\", MATCH(A55, Application.!A:A, 0))","v":63}]
[56,"  ","i ","   "," e",null,"Zigbee 3.0",null,false,"No",null,null,null,null,null,"",{"$f":"IF(ISNA(MATCH(A56, Application.!A:A, 0)), \"\", MATCH(A56, Application.!A:A, 0))","v":64}]
[57,"  ","i ","   "," e",null,"Other (explain)",null,null,{"$f":"H57","v":0},null,null,null,null,null,"",{"$f":"IF(ISNA(MATCH(A57, Application.!A:A, 0)), \"\", MATCH(A57, Application.!A:A, 0))","v":65}]
[58,"  ","\n i ","   "," e","Does the system require a computer server, either local or cloud-based? If the system offers both options, check both options. ",null,"Select all that apply",null,null,null,null,null,null,null,54,{"$f":"IF(ISNA(MATCH(A58, Application.!A:A, 0)), \"\", MATCH(A58, Application.!A:A, 0))","v":66}]
[59,null,null,null,null,null,"Local Server",null,false,{"$f":"IF(I59=TRUE,\"Yes\", \"No\")","v":"No"},null,null,null,null,null,56,{"$f":"IF(ISNA(MATCH(A59, Application.!A:A, 0)), \"\", MATCH(A59, Application.!A:A, 0))","v":67}]
[60,null,null,null,null,null,"Cloud Server",null,false,{"$f":"IF(I60=TRUE,\"Yes\", \"No\")","v":"No"},null,null,null,null,null,58,{"$f":"IF(ISNA(MATCH(A60, Application.!A:A, 0)), \"\", MATCH(A60, Application.!A:A, 0))","v":68}]
[61,"I ","  ","E","   ","1)","Networking of Luminaires and Devices",null,null,null,null,null,null,null,null,69,{"$f":"IF(ISNA(MATCH(A61, Application.!A:A, 0)), \"\", MATCH(A61, Application.!A:A, 0))","v":69}]
[62,"I ","  ","E","   ","2)","Occupancy Sensing",null,null,null,null,null,null,null,null,70,{"$f":"IF(ISNA(MATCH(A62, Application.!A:A, 0)), \"\", MATCH(A62, Application.!A:A, 0))","v":70}]
[63,"  \n \n \n\n","  \n \n \n\n","  \n \n \n\n","  \n \n \n\n","Definition:  The capability to affect the operation of lighting or other equipment based upon detecting the presence or absence of \npeople in a space or exterior environment.",null,null,null,null,null,null,null,null,null,71,{"$f":"IF(ISNA(MATCH(A63, Application.!A:A, 0)), \"\", MATCH(A63, Application.!A:A, 0))","v":71}]
[64,"I ","  ","E","   ","Does the system have occupancy sensing capability?",null,"Yes",true,{"$f":"IF(I64=TRUE,\"Yes\", \"No\")","v":"Yes"},"05-Brochure, Page 40 thru 43",null,"y",null,null,72,{"$f":"IF(ISNA(MATCH(A64, Application.!A:A, 0)), \"\", MATCH(A64, Application.!A:A, 0))","v":72}]
[65,null,"i",null,"e\n","Does the system have a vacancy mode option? (manual on, automatic off) ",null,"Yes",true,"Yes","05-Brochure, Page 40 thru 43",null,"y",null,null,73,{"$f":"IF(ISNA(MATCH(A65, Application.!A:A, 0)), \"\", MATCH(A65, Application.!A:A, 0))","v":""}]
[66,null,"i",null,"e\n  ","Is automatic-on the default setting (as opposed to vacancy sensing)? Include a reference describing how this setting changed.",null,"Yes",true,"Yes","01-Programming Guide, Page 18, #6",null,"y",null,null,74,{"$f":"IF(ISNA(MATCH(A66, Application.!A:A, 0)), \"\", MATCH(A66, Application.!A:A, 0))","v":73}]
[67,"  ","i ","   "," e","What mode(s) of detection are offered in single mode? ",null,"Choose all that apply.",null,null,null,null,null,null,null,75,{"$f":"IF(ISNA(MATCH(A67, Application.!A:A, 0)), \"\", MATCH(A67, Application.!A:A, 0))","v":""}]
[68,"  ","i ","   "," e",null,"Microphonic",null,false,"No",null,null,null,null,null,76,{"$f":"IF(ISNA(MATCH(A68, Application.!A:A, 0)), \"\", MATCH(A68, Application.!A:A, 0))","v":74}]
[69,"  ","i ","   "," e",null,"Microwave",null,false,"No",null,null,null,null,null,77,{"$f":"IF(ISNA(MATCH(A69, Application.!A:A, 0)), \"\", MATCH(A69, Application.!A:A, 0))","v":75}]
[70,"  ","i ","   "," e",null,"Optical",null,false,"No",null,null,null,null,null,78,{"$f":"IF(ISNA(MATCH(A70, Application.!A:A, 0)), \"\", MATCH(A70, Application.!A:A, 0))","v":76}]
[71,"  ","i ","   "," e",null,"PIR",null,true,"Yes","06-Wireless Occ Sensor Spec Submittal, Page 1",null,"y",null,null,79,{"$f":"IF(ISNA(MATCH(A71, Application.!A:A, 0)), \"\", MATCH(A71, Application.!A:A, 0))","v":77}]
[72,"  ","i ","   "," e",null,"Ultrasonic",null,true,"Yes","24p1  LOS-CUS",null,"y","sent usnd-only doc",null,81,{"$f":"IF(ISNA(MATCH(A72, Application.!A:A, 0)), \"\", MATCH(A72, Application.!A:A, 0))","v":78}]
[73,"  ","i ","   "," e",null,"Video",null,false,"No",null,null,null,null,null,82,{"$f":"IF(ISNA(MATCH(A73, Application.!A:A, 0)), \"\", MATCH(A73, Application.!A:A, 0))","v":79}]
[74,"  ","i ","   "," e",null,"Other (explain)",null,null,{"$f":"H74","v":0},null,null,null,null,null,83,{"$f":"IF(ISNA(MATCH(A74, Application.!A:A, 0)), \"\", MATCH(A74, Application.!A:A, 0))","v":""}]
[75,"  ","i ","   "," e","What mode(s) of detection are offered in dual mode? ",null,"Choose all that apply.",null,null,null,null,null,null,null,84,{"$f":"IF(ISNA(MATCH(A75, Application.!A:A, 0)), \"\", MATCH(A75, Application.!A:A, 0))","v":80}]
[76,"  ","i ","   "," e",null,"Microphonic",null,false,{"$f":"IF(I76=TRUE,\"Yes\", \"No\")","v":"No"},null,null,null,null,null,85,{"$f":"IF(ISNA(MATCH(A76, Application.!A:A, 0)), \"\", MATCH(A76, Application.!A:A, 0))","v":""}]
[77,"  ","i ","   "," e",null,"Microwave",null,false,"No",null,null,null,null,null,86,{"$f":"IF(ISNA(MATCH(A77, Application.!A:A, 0)), \"\", MATCH(A77, Application.!A:A, 0))","v":81}]
[78,"  ","i ","   "," e",null,"Optical",null,false,"No",null,null,null,null,null,87,{"$f":"IF(ISNA(MATCH(A78, Application.!A:A, 0)), \"\", MATCH(A78, Application.!A:A, 0))","v":82}]
[79,"  ","i ","   "," e",null,"PIR",null,true,"Yes","06-Wireless Occ Sensor Spec Submittal",null,"y",null,null,88,{"$f":"IF(ISNA(MATCH(A79, Application.!A:A, 0)), \"\", MATCH(A79, Application.!A:A, 0))","v":83}]
[80,"  ","i ","   "," e",null,"Ultrasonic",null,true,"Yes","22-Wired to Wireless App Note, 07-Wired Occ Sensor Spec Submittal, Page 1",null,"y",null,null,90,{"$f":"IF(ISNA(MATCH(A80, Application.!A:A, 0)), \"\", MATCH(A80, Application.!A:A, 0))","v":84}]
[81,"  ","i ","   "," e",null,"Video",null,false,"No",null,null,null,null,null,91,{"$f":"IF(ISNA(MATCH(A81, Application.!A:A, 0)), \"\", MATCH(A81, Application.!A:A, 0))","v":85}]
[82,"  ","i ","   "," e",null,"Other (explain)",null,null,{"$f":"H82","v":0},null,null,null,null,null,92,{"$f":"IF(ISNA(MATCH(A82, Application.!A:A, 0)), \"\", MATCH(A82, Application.!A:A, 0))","v":86}]
[83," ","\n i",null,null,"For PIR sensors, what coverage options are offered, as defined in NEMA WD7-2011, for standard height?",null,"Choose all that apply.",null,null,null,null,null,null,null,93,{"$f":"IF(ISNA(MATCH(A83, Application.!A:A, 0)), \"\", MATCH(A83, Application.!A:A, 0))","v":87}]
[84," ","i",null,null,null,"Ceiling",null,true,{"$f":"IF(I84=TRUE,\"Yes\", \"No\")","v":"Yes"},"05-Brochure, Page 40 & 41",null,"y",null,null,94,{"$f":"IF(ISNA(MATCH(A84, Application.!A:A, 0)), \"\", MATCH(A84, Application.!A:A, 0))","v":88}]
[85," ","i",null,null,null,"Corner",null,true,{"$f":"IF(I85=TRUE,\"Yes\", \"No\")","v":"Yes"},"05-Brochure, Page 42 & 43",null,"y",null,null,95,{"$f":"IF(ISNA(MATCH(A85, Application.!A:A, 0)), \"\", MATCH(A85, Application.!A:A, 0))","v":89}]
[86," ","i",null,null,null,"Corridor",null,true,{"$f":"IF(I86=TRUE,\"Yes\", \"No\")","v":"Yes"},"05-Brochure, Page 42 & 43",null,"y",null,null,96,{"$f":"IF(ISNA(MATCH(A86, Application.!A:A, 0)), \"\", MATCH(A86, Application.!A:A, 0))","v":90}]
[87," ","i",null,null,null,"Wall  ",null,true,{"$f":"IF(I87=TRUE,\"Yes\", \"No\")","v":"Yes"},"05-Brochure, Page 42 & 43",null,"y",null,null,97,{"$f":"IF(ISNA(MATCH(A87, Application.!A:A, 0)), \"\", MATCH(A87, Application.!A:A, 0))","v":91}]
[88," ","i",null,null,null,"Other (explain)",null,null,{"$f":"H88","v":0},null,null,null,null,null,98,{"$f":"IF(ISNA(MATCH(A88, Application.!A:A, 0)), \"\", MATCH(A88, Application.!A:A, 0))","v":92}]
[89," ","\n i",null,null,"For PIR sensors, what coverage options are offered, as defined in NEMA WD7-2011, for high-bay height?",null,"Choose all that apply.",null,null,null,null,null,null,null,99,{"$f":"IF(ISNA(MATCH(A89, Application.!A:A, 0)), \"\", MATCH(A89, Application.!A:A, 0))","v":93}]
[90," ","i",null,null,null,"Ceiling",null,false,{"$f":"IF(I90=TRUE,\"Yes\", \"No\")","v":"No"},"22-Wired to Wireless App Note, 07-Wired Occ Sensor Spec Submittal, Page 1",null,null,"can integrate 3rd party sensor.  22","07p1 \"when mounted on an 8 ft to 12 ft (2.4 m to 3.7 m) ceiling\"  Please provide sensor documentation for product intended for high-bay applications",100,{"$f":"IF(ISNA(MATCH(A90, Application.!A:A, 0)), \"\", MATCH(A90, Application.!A:A, 0))","v":94}]
[91," ","i",null,null,null,"Corner",null,false,{"$f":"IF(I91=TRUE,\"Yes\", \"No\")","v":"No"},null,null,null,null,null,101,{"$f":"IF(ISNA(MATCH(A91, Application.!A:A, 0)), \"\", MATCH(A91, Application.!A:A, 0))","v":95}]
[92," ","i",null,null,null,"Corridor",null,false,{"$f":"IF(I92=TRUE,\"Yes\", \"No\")","v":"No"},null,null,null,null,null,102,{"$f":"IF(ISNA(MATCH(A92, Application.!A:A, 0)), \"\", MATCH(A92, Application.!A:A, 0))","v":96}]
[93," ","i",null,null,null,"Wall  ",null,false,{"$f":"IF(I93=TRUE,\"Yes\", \"No\")","v":"No"},null,null,null,null,null,103,{"$f":"IF(ISNA(MATCH(A93, Application.!A:A, 0)), \"\", MATCH(A93, Application.!A:A, 0))","v":97}]
[94," ","i",null,null,null,"Other (explain)","High bay ceiling with 3rd party wired sensor",null,{"$f":"H94","v":"High bay ceiling with 3rd party wired sensor"},"22-Wired to Wireless App ",null,"y","explains how to use 3rd party sensor",null,104,{"$f":"IF(ISNA(MATCH(A94, Application.!A:A, 0)), \"\", MATCH(A94, Application.!A:A, 0))","v":98}]
[95,"  ","i ","   "," e","What is the default time delay setting in minutes?",null,15,null,{"$f":"H95","v":15},"06-Wireless Occ Sensor Spec Submittal, Page 2, Timeout Options",null,"y",null,null,105,{"$f":"IF(ISNA(MATCH(A95, Application.!A:A, 0)), \"\", MATCH(A95, Application.!A:A, 0))","v":99}]
[96,null,"i ","  "," e","Is time delay field adjustable?  If yes, include a reference describing how",null,null,true,{"$f":"IF(I96=TRUE,\"Yes\", \"No\")","v":"Yes"},"01-Programming Guide, Page 18, #7 & 8",null,"y","06p2, 01p18",null,106,{"$f":"IF(ISNA(MATCH(A96, Application.!A:A, 0)), \"\", MATCH(A96, Application.!A:A, 0))","v":106}]
[97,"   \n ","i","    \n "," e \n ","Can the sensitivity and range of the system response to occupancy be adjusted? If yes, include a reference describing how ",null,null,true,{"$f":"IF(I97=TRUE,\"Yes\", \"No\")","v":"Yes"},"01-Programming Guide, Page 17, #5",null,"y",null,null,"",{"$f":"IF(ISNA(MATCH(A97, Application.!A:A, 0)), \"\", MATCH(A97, Application.!A:A, 0))","v":107}]
[98,null,"i \n \n  "," "," e\n \n \n  ","Does the system have the ability to set a dim level rather than off when unoccupied? (can the lights be set to 30% dim level rather than off when no occupancy is detected?)  If yes, include a reference describing how",null,null,true,{"$f":"IF(I98=TRUE,\"Yes\", \"No\")","v":"Yes"},"01-Programming Guide, Page 17, #4",null,"y",null,null,109,{"$f":"IF(ISNA(MATCH(A98, Application.!A:A, 0)), \"\", MATCH(A98, Application.!A:A, 0))","v":108}]
[99,"  \n ","i \n ","   \n "," e\n ",null,"If yes, is this unoccupied dim level adjustable?  If yes, include a reference describing how",null,true,{"$f":"IF(I99=TRUE,\"Yes\", \"No\")","v":"Yes"},"01-Programming Guide, Page 17, #4",null,"y",null,null,110,{"$f":"IF(ISNA(MATCH(A99, Application.!A:A, 0)), \"\", MATCH(A99, Application.!A:A, 0))","v":109}]
[100,"I ","  ","E","   ","2)","Occupancy Sensing",null,null,null,null,null,null,null,null,111,{"$f":"IF(ISNA(MATCH(A100, Application.!A:A, 0)), \"\", MATCH(A100, Application.!A:A, 0))","v":110}]
[101,null,null,"E",null,"3)","Traffic Sensing (Exterior only)",null,null,null,null,null,null,null,null,112,{"$f":"IF(ISNA(MATCH(A101, Application.!A:A, 0)), \"\", MATCH(A101, Application.!A:A, 0))","v":111}]
[102," ","  \n \n","  .\n \n \n \n \n \n\n \n"," \n  \n \n \n\n \n \n \n \n \n ","Definition:  The capability to affect the operation of lighting or other equipment based upon detecting the presence or absence of moving vehicles in an area or exterior environment.  \n\nExterior systems may satisfy this requirement through External Systems Integration as described below in lieu of in-network occupancy sensors if another source of data is used for traffic or pedestrian sensing.\n\nExterior systems must include either Occupancy Sensing or Traffic Sensing.  They may include both, but that is not required. ",null,null,null,null,null,null,null,null,null,113,{"$f":"IF(ISNA(MATCH(A102, Application.!A:A, 0)), \"\", MATCH(A102, Application.!A:A, 0))","v":112}]
[103,null,null,"E","   ","Does the system have traffic sensing capability?",null,null,false,{"$f":"IF(I103=TRUE,\"Yes\", \"No\")","v":"No"},null,null,null,null,null,114,{"$f":"IF(ISNA(MATCH(A103, Application.!A:A, 0)), \"\", MATCH(A103, Application.!A:A, 0))","v":113}]
[104,null,null,"   "," e","What mode(s) of detection are offered?",null,"Choose all that apply.",null,null,null,null,null,null,null,115,{"$f":"IF(ISNA(MATCH(A104, Application.!A:A, 0)), \"\", MATCH(A104, Application.!A:A, 0))","v":114}]
[105,null,null,"   "," e",null,"Microphonic",null,false,{"$f":"IF(I105=TRUE,\"Yes\", \"No\")","v":"No"},null,null,null,null,null,"",{"$f":"IF(ISNA(MATCH(A105, Application.!A:A, 0)), \"\", MATCH(A105, Application.!A:A, 0))","v":115}]
[106,null,null,"   "," e",null,"Microwave",null,false,"No",null,null,null,null,null,"",{"$f":"IF(ISNA(MATCH(A106, Application.!A:A, 0)), \"\", MATCH(A106, Application.!A:A, 0))","v":116}]
[107,null,null,"   "," e",null,"Optical",null,false,"No",null,null,null,null,null,"",{"$f":"IF(ISNA(MATCH(A107, Application.!A:A, 0)), \"\", MATCH(A107, Application.!A:A, 0))","v":117}]
[108,null,null,"   "," e",null,"PIR",null,false,"No",null,null,null,null,null,"",{"$f":"IF(ISNA(MATCH(A108, Application.!A:A, 0)), \"\", MATCH(A108, Application.!A:A, 0))","v":118}]
[109,null,null,"   "," e",null,"Ultrasonic",null,false,"No",null,null,null,null,null,"",{"$f":"IF(ISNA(MATCH(A109, Application.!A:A, 0)), \"\", MATCH(A109, Application.!A:A, 0))","v":119}]
[110,null,null,"   "," e",null,"Video",null,false,"No",null,null,null,null,null,"",{"$f":"IF(ISNA(MATCH(A110, Application.!A:A, 0)), \"\", MATCH(A110, Application.!A:A, 0))","v":120}]
[111,null,null,"   "," e",null,"Other (explain)",null,null,{"$f":"H111","v":0},null,null,null,null,null,"",{"$f":"IF(ISNA(MATCH(A111, Application.!A:A, 0)), \"\", MATCH(A111, Application.!A:A, 0))","v":121}]
[112,null,null,"   "," e","What is the default time delay setting in minutes?",null,null,null,{"$f":"H112","v":0},null,null,null,null,null,"",{"$f":"IF(ISNA(MATCH(A112, Application.!A:A, 0)), \"\", MATCH(A112, Application.!A:A, 0))","v":122}]
[113,null,null,"   \n "," e\n ","Is time delay field adjustable?  If yes, include a reference describing how",null,null,false,{"$f":"IF(I113=TRUE,\"Yes\", \"No\")","v":"No"},null,null,null,null,null,"",{"$f":"IF(ISNA(MATCH(A113, Application.!A:A, 0)), \"\", MATCH(A113, Application.!A:A, 0))","v":123}]
[114,null,null,"    \n ","\n  e \n ","Can the sensitivity and range of the system response to occupancy be adjusted? If yes, include a reference describing how ",null,null,false,{"$f":"IF(I114=TRUE,\"Yes\", \"No\")","v":"No"},null,null,null,null,null,"",{"$f":"IF(ISNA(MATCH(A114, Application.!A:A, 0)), \"\", MATCH(A114, Application.!A:A, 0))","v":124}]
[115,null,null,null," e\n \n \n  ","Does the system have the ability to set a dim level rather than off when unoccupied? (can the lights be set to 30% dim level rather than off when no occupancy is detected?)  If yes, include a reference describing how",null,null,false,{"$f":"IF(I115=TRUE,\"Yes\", \"No\")","v":"No"},null,null,null,null,null,"",{"$f":"IF(ISNA(MATCH(A115, Application.!A:A, 0)), \"\", MATCH(A115, Application.!A:A, 0))","v":125}]
[116,null,null,"   \n "," e\n ",null,"If yes, is this unoccupied dim level adjustable?  If yes, include a reference describing how",null,false,{"$f":"IF(I116=TRUE,\"Yes\", \"No\")","v":"No"},null,null,null,null,null,"",{"$f":"IF(ISNA(MATCH(A116, Application.!A:A, 0)), \"\", MATCH(A116, Application.!A:A, 0))","v":126}]
[117,null,null,"E","   ","3)","Traffic Sensing (Exterior only)",null,null,null,null,null,null,null,null,119,{"$f":"IF(ISNA(MATCH(A117, Application.!A:A, 0)), \"\", MATCH(A117, Application.!A:A, 0))","v":127}]
[118,"I ","  ","E","   ","4)","Daylight Harvesting / Photocell Control",null,null,null,null,null,null,null,null,120,{"$f":"IF(ISNA(MATCH(A118, Application.!A:A, 0)), \"\", MATCH(A118, Application.!A:A, 0))","v":128}]
[119," \n \n \n \n"," \n \n \n \n"," \n \n \n \n"," \n \n \n \n \n","Definition:  The capability to automatically affect the operation of lighting or other equipment based on the amount of daylight and/or ambient light that is present in a space, area,  or exterior environment.  This capability is typically called Daylight Harvesting for Interior systems, and Photocell Control for Exterior systems.",null,null,null,null,null,null,null,null,null,121,{"$f":"IF(ISNA(MATCH(A119, Application.!A:A, 0)), \"\", MATCH(A119, Application.!A:A, 0))","v":129}]
[120,"I  ",null,"E"," ","Does the system have Daylight Harvesting / Photocell Control capability?",null,null,true,{"$f":"IF(I120=TRUE,\"Yes\", \"No\")","v":"Yes"},"05-Brochure, Page 44 & 45",null,"y",null,null,122,{"$f":"IF(ISNA(MATCH(A120, Application.!A:A, 0)), \"\", MATCH(A120, Application.!A:A, 0))","v":130}]
[121,"  ","i ","   "," e","Does the system offer open loop, closed loop, or both?",null,"Select all that apply",null,null,null,null,null,null,null,123,{"$f":"IF(ISNA(MATCH(A121, Application.!A:A, 0)), \"\", MATCH(A121, Application.!A:A, 0))","v":131}]
[122,"  ","i ","   "," e",null,"Open loop",null,true,{"$f":"IF(I122=TRUE,\"Yes\", \"No\")","v":"Yes"},"08-Wireless Daylight Sensor Spec Submittal, Page 1, Features #2",null,"y",null,null,124,{"$f":"IF(ISNA(MATCH(A122, Application.!A:A, 0)), \"\", MATCH(A122, Application.!A:A, 0))","v":132}]
[123,"  ","i ","   ",null,null,"Closed loop",null,true,{"$f":"IF(I123=TRUE,\"Yes\", \"No\")","v":"Yes"},"12-Eco PowPak Spec Submittal, Page 5",null,"y",null,null,125,{"$f":"IF(ISNA(MATCH(A123, Application.!A:A, 0)), \"\", MATCH(A123, Application.!A:A, 0))","v":133}]
[124,"  \n \n \n ","i \n \n \n ","   \n \n \n "," e\n \n \n ","Does the system have the capability to turn a light source fully off when sufficient daylight is present? If yes, include a reference describing how this is accomplished.",null,null,true,{"$f":"IF(I124=TRUE,\"Yes\", \"No\")","v":"Yes"},"http://www.lutron.com/TechnicalDocumentLibrary/3683587_Daylight_Sensor_Design_and_App_Guide_sg.pdf",null,"y","05p5",null,127,{"$f":"IF(ISNA(MATCH(A124, Application.!A:A, 0)), \"\", MATCH(A124, Application.!A:A, 0))","v":134}]
[125,"  ","i ","   "," e",null,"If yes, describe any additional components needed","NA",null,{"$f":"H125","v":"NA"},null,null,"y","05p44-45 Daylight sensors? (e.g. LRF2-DCRB-WH)","need the daylight sensor, but no additional relays.  Done thru vive gui",128,{"$f":"IF(ISNA(MATCH(A125, Application.!A:A, 0)), \"\", MATCH(A125, Application.!A:A, 0))","v":135}]
[126,"  \n \n ","i \n \n ","   \n \n ",null,"Does the system provide integration with shading systems? If yes, include a reference describing how this is accomplished. ",null,null,false,{"$f":"IF(I126=TRUE,\"Yes\", \"No\")","v":"No"},null,null,null,"capability may be coming later","02p01: Contact Closure Inputs for integration with devices by others including devices for Title 24 Automatic Demand Response.\"",129,{"$f":"IF(ISNA(MATCH(A126, Application.!A:A, 0)), \"\", MATCH(A126, Application.!A:A, 0))","v":136}]
[127,"  ","i ","   ",null,null,"If yes, describe any additional components needed",null,null,{"$f":"H127","v":0},null,null,null,null,null,130,{"$f":"IF(ISNA(MATCH(A127, Application.!A:A, 0)), \"\", MATCH(A127, Application.!A:A, 0))","v":137}]
[128,"  \n \n \n","i \n \n \n","   \n \n \n"," e\n \n \n","Can the response of the system to the data from the photosensor be adjusted? If yes, include a reference describing how this is accomplished. ",null,null,true,{"$f":"IF(I128=TRUE,\"Yes\", \"No\")","v":"Yes"},"08-Wireless Daylight Sensor Spec Submittal (Instructions for adjustment in GUI)",null,"y","01p24",null,131,{"$f":"IF(ISNA(MATCH(A128, Application.!A:A, 0)), \"\", MATCH(A128, Application.!A:A, 0))","v":138}]
[129,"  \n \n","i \n \n","   \n \n"," e\n \n","Are the output light levels for daylight harvesting/photocell control continuously variable (more than 99 steps)? ",null,null,true,{"$f":"IF(I129=TRUE,\"Yes\", \"No\")","v":"Yes"},"08-Wireless Daylight Sensor Spec Submittal",null,"y","08p1: \"Designed to give a linear response to changes in viewed light level.  Light range 0 to 1600 lx (0 to 150 fc). \"",null,"",{"$f":"IF(ISNA(MATCH(A129, Application.!A:A, 0)), \"\", MATCH(A129, Application.!A:A, 0))","v":139}]
[130,"  ","i ","   "," e",null," If not continuously variable, how many steps?",null,null,{"$f":"H130","v":0},null,null,null,null,null,"",{"$f":"IF(ISNA(MATCH(A130, Application.!A:A, 0)), \"\", MATCH(A130, Application.!A:A, 0))","v":140}]
[131,"  \n \n","i \n \n","   \n \n"," e\n \n","Does the system have the capability to report photosensor settings (adjustable input parameters) in a user interface? ",null,null,true,{"$f":"IF(I131=TRUE,\"Yes\", \"No\")","v":"Yes"},"21-Daylight Sensor Adjustment (Screenshots from software - can be demonstrated)",null,"y","slider, incr of 1, 1 to 15.  change the number to change the response of luminaire or group, to a certain photosensor reading. Explained in review.","What information is reported? Please provide screenshots or demonstrate.",132,{"$f":"IF(ISNA(MATCH(A131, Application.!A:A, 0)), \"\", MATCH(A131, Application.!A:A, 0))","v":141}]
[132,null,null,null,"e\n","Does the system have a 5 or 7-pin ANSI c136.41 socket for photosensor control with dimming?",null,null,false,{"$f":"IF(I132=TRUE,\"Yes\", \"No\")","v":"No"},null,null,null,null,null,135,{"$f":"IF(ISNA(MATCH(A132, Application.!A:A, 0)), \"\", MATCH(A132, Application.!A:A, 0))","v":142}]
[133,"I ","  ","E","   ","4)","Daylight Harvesting / Photocell Control",null,null,null,null,null,null,null,null,136,{"$f":"IF(ISNA(MATCH(A133, Application.!A:A, 0)), \"\", MATCH(A133, Application.!A:A, 0))","v":143}]
[134,"I ","  ","E","   ","5)","High-End Trim",null,null,null,null,null,null,null,null,137,{"$f":"IF(ISNA(MATCH(A134, Application.!A:A, 0)), \"\", MATCH(A134, Application.!A:A, 0))","v":144}]
[135," \n \n \n  \n \n \n"," \n \n \n  \n \n \n"," \n \n \n  \n \n \n"," .\n \n \n \n \n \n \n  \n \n","Definition:  The capability to set the maximum light output to a less-than-maximum state of an individual or group of luminaires at the time of installation or commissioning. High-End Trim must be field reconfigurable.  This capability is distinct from automatic compensation for lumen depreciation, which automatically increases output as a system operates over time.\n\n*While DLC specifically requires “High-End Trim”, some manufacturers refer to this capability as “Task Tuning” or “Tuning” within their system interfaces. Refer to NEMA LSD 64-2014 for definitions of Lighting Controls Terminology. ",null,null,null,null,null,null,null,null,null,138,{"$f":"IF(ISNA(MATCH(A135, Application.!A:A, 0)), \"\", MATCH(A135, Application.!A:A, 0))","v":145}]
[136,"I ","  \n ","E","   \n ","Does the system have field-reconfigurable high-end trim capability? ",null,null,true,{"$f":"IF(I136=TRUE,\"Yes\", \"No\")","v":"Yes"},"01-Programming Guide, Page 20, 3a",null,"y",null,null,139,{"$f":"IF(ISNA(MATCH(A136, Application.!A:A, 0)), \"\", MATCH(A136, Application.!A:A, 0))","v":146}]
[137,"  ","i ","   "," e","How low as a % of maximum can high-end trim be adjusted?",null,0.55000000000000004,null,{"$f":"H137","v":0.55000000000000004},"03-0-10V PowPak Spec Submittal, Page 4",null,"y","03p4: \"The maximum light output of connected fixtures can be decreased down to 55% for energy savings in over-lit spaces.\"",null,140,{"$f":"IF(ISNA(MATCH(A137, Application.!A:A, 0)), \"\", MATCH(A137, Application.!A:A, 0))","v":147}]
[138,"  \n ","i \n ","   \n "," e\n ","Does the system have the capability to report out high-end trim settings? ",null,null,true,{"$f":"IF(I138=TRUE,\"Yes\", \"No\")","v":"Yes"},null,null,"y","01p20 image",null,141,{"$f":"IF(ISNA(MATCH(A138, Application.!A:A, 0)), \"\", MATCH(A138, Application.!A:A, 0))","v":148}]
[139,"  ","i ","   "," e",null,"If so, what settings are available to be reported?",null,null,{"$f":"H139","v":0},null,null,null,null,null,142,{"$f":"IF(ISNA(MATCH(A139, Application.!A:A, 0)), \"\", MATCH(A139, Application.!A:A, 0))","v":149}]
[140,"  \n ","i \n ","   \n "," e\n ","Are the settings for high end trim continuously variable (more than 99 steps)? ",null,null,true,{"$f":"IF(I140=TRUE,\"Yes\", \"No\")","v":"Yes"},"03-0-10V PowPak Spec Submittal",null,"y","0-10V, so assume that infinite adjustments within the 100% - 55% high-end trim range and 45% - 0% low-end trim range",null,"",{"$f":"IF(ISNA(MATCH(A140, Application.!A:A, 0)), \"\", MATCH(A140, Application.!A:A, 0))","v":150}]
[141,"  ","i ","   "," e",null," If not continuously variable, how many steps?",null,null,{"$f":"H141","v":0},null,null,null,null,null,"",{"$f":"IF(ISNA(MATCH(A141, Application.!A:A, 0)), \"\", MATCH(A141, Application.!A:A, 0))","v":151}]
[142,"  \n\n ","i \n\n ","   \n\n "," e\n\n ","What is the factory default setting for high-end trim, in terms of % max control signal or percent of light output for integrated systems?",null,1,null,{"$f":"H142","v":1},null,null,"y",null,"Demonstrated during webinar presentation",143,{"$f":"IF(ISNA(MATCH(A142, Application.!A:A, 0)), \"\", MATCH(A142, Application.!A:A, 0))","v":152}]
[143,"I ","  ","E","   ","5)","High End Trim",null,null,null,null,null,null,null,null,144,{"$f":"IF(ISNA(MATCH(A143, Application.!A:A, 0)), \"\", MATCH(A143, Application.!A:A, 0))","v":155}]
[144,"I ","  ","E","   ","6)","Zoning",null,null,null,null,null,null,null,null,145,{"$f":"IF(ISNA(MATCH(A144, Application.!A:A, 0)), \"\", MATCH(A144, Application.!A:A, 0))","v":156}]
[145," \n  \n \n \n \n \n \n \n \n"," \n  \n \n \n \n \n \n \n \n"," \n  \n \n \n \n \n \n \n \n"," \n  \n \n \n \n \n \n \n\n \n","Definition:  The capability to group luminaires and form unique lighting control zones for a control strategy via software-defined means, and not via physical configuration of mechanical or electrical installation details (e.g. wiring). \n     Interior:  Zoning is required for Occupancy Sensing, High End Trim, and Daylight Harvesting control strategies except for systems that feature Luminaire Level Control (LLC) capabilities as defined in this specification under “Reported Capabilities”, in which case zoning is only required for Occupancy Sensing and High-End Trim control strategies.\n     Exterior: Zoning is required for High End Trim",null,null,null,null,null,null,null,null,null,146,{"$f":"IF(ISNA(MATCH(A145, Application.!A:A, 0)), \"\", MATCH(A145, Application.!A:A, 0))","v":157}]
[146,"I ","  ","E","   ","Does the system have Zoning capability as defined?",null,null,true,{"$f":"IF(I146=TRUE,\"Yes\", \"No\")","v":"Yes"},"01-Programming Guide, Pages 8 thru 13, 12-Eco PowPak Spec Submittal",null,"y","Area/Rooms (01p8-13) and Occupancy Groups (01p19)",null,147,{"$f":"IF(ISNA(MATCH(A146, Application.!A:A, 0)), \"\", MATCH(A146, Application.!A:A, 0))","v":158}]
[147,"I ","  ","E","   ","6)","Zoning",null,null,null,null,null,null,null,null,148,{"$f":"IF(ISNA(MATCH(A147, Application.!A:A, 0)), \"\", MATCH(A147, Application.!A:A, 0))","v":159}]
[148,"I ","  ","E","   ","7)","Luminaire and Device Addressability",null,null,null,null,null,null,null,null,149,{"$f":"IF(ISNA(MATCH(A148, Application.!A:A, 0)), \"\", MATCH(A148, Application.!A:A, 0))","v":160}]
[149," \n \n \n \n \n"," \n \n  \n \n \n"," \n \n  \n \n \n"," \n \n  \n \n \n","Definition:  The ability to uniquely identify and/or address each individual luminaire, sensor, controller, and user interface device in the lighting system, allowing for configuration and re-configuration of devices and control zones independent of electrical circuiting. ",null,null,null,null,null,null,null,null,null,150,{"$f":"IF(ISNA(MATCH(A149, Application.!A:A, 0)), \"\", MATCH(A149, Application.!A:A, 0))","v":161}]
[150,"I","  \n ","E","   \n ","Does the system have Luminaire and Device Addressability capability?",null,null,true,{"$f":"IF(I150=TRUE,\"Yes\", \"No\")","v":"Yes"},"16-Integral Fixture Control Spec Submittal, 12-Eco PowPak Spec Submittal",null,"y","16p1, 01p10",null,151,{"$f":"IF(ISNA(MATCH(A150, Application.!A:A, 0)), \"\", MATCH(A150, Application.!A:A, 0))","v":162}]
[151,"I ","  ","E","   ","7)","Luminaire and Device Addressability",null,null,null,null,null,null,null,null,152,{"$f":"IF(ISNA(MATCH(A151, Application.!A:A, 0)), \"\", MATCH(A151, Application.!A:A, 0))","v":163}]
[152,"I ","  ","E","   ","8)","Continuous Dimming",null,null,null,null,null,null,null,null,153,{"$f":"IF(ISNA(MATCH(A152, Application.!A:A, 0)), \"\", MATCH(A152, Application.!A:A, 0))","v":164}]
[153," \n \n \n \n"," \n \n \n \n"," \n \n \n \n"," \n \n \n \n","Definition:  The capability of a control system to provide control with sufficient resolution (100+ steps) to support light level changes perceived as smooth (as opposed to step dimming with a small number of discrete light levels).",null,null,null,null,null,null,null,null,null,154,{"$f":"IF(ISNA(MATCH(A153, Application.!A:A, 0)), \"\", MATCH(A153, Application.!A:A, 0))","v":165}]
[154,"I \n ","  \n ","E","   \n ","Does the system provide continuous dimming according to the definition above for at least one mode of operation?",null,null,true,{"$f":"IF(I154=TRUE,\"Yes\", \"No\")","v":"Yes"},"05-Brochure, Page 2",null,"y",null,null,155,{"$f":"IF(ISNA(MATCH(A154, Application.!A:A, 0)), \"\", MATCH(A154, Application.!A:A, 0))","v":166}]
[155,"  \n ","i \n ","   \n "," e\n ","What type(s) of continuous dimming control according to the definition above does the system provide?",null,"Select all that apply",null,null,null,null,null,null,null,"",{"$f":"IF(ISNA(MATCH(A155, Application.!A:A, 0)), \"\", MATCH(A155, Application.!A:A, 0))","v":167}]
[156,"  ","i ","   "," e",null,"DALI",null,false,"No",null,null,null,null,null,"",{"$f":"IF(ISNA(MATCH(A156, Application.!A:A, 0)), \"\", MATCH(A156, Application.!A:A, 0))","v":168}]
[157,"  ","i ","   "," e",null,"DMX",null,false,"No",null,null,null,null,null,"",{"$f":"IF(ISNA(MATCH(A157, Application.!A:A, 0)), \"\", MATCH(A157, Application.!A:A, 0))","v":169}]
[158,"  ","i ","   "," e",null,"0-10V",null,true,"Yes","03-0-10V PowPak Spec Submittal",null,"y",null,null,"",{"$f":"IF(ISNA(MATCH(A158, Application.!A:A, 0)), \"\", MATCH(A158, Application.!A:A, 0))","v":170}]
[159,"  ","i ","   "," e",null,"Zigbee",null,false,"No",null,null,null,null,null,"",{"$f":"IF(ISNA(MATCH(A159, Application.!A:A, 0)), \"\", MATCH(A159, Application.!A:A, 0))","v":171}]
[160,"  ","i ","   "," e",null,"Forward Phase/Triac/ Magnetic Low Voltage (MLV)/Leading Edge",null,true,"Yes","11-Maestro Wireless Spec Submittal",null,"y","11p1,2",null,"",{"$f":"IF(ISNA(MATCH(A160, Application.!A:A, 0)), \"\", MATCH(A160, Application.!A:A, 0))","v":172}]
[161,"  ","i ","   "," e",null,"Reverse Phase/Electronic Low Voltage (ELV)/Trailing Edge",null,true,"Yes","11-Maestro Wireless Spec Submittal",null,"y","11p1,2",null,"",{"$f":"IF(ISNA(MATCH(A161, Application.!A:A, 0)), \"\", MATCH(A161, Application.!A:A, 0))","v":173}]
[162,"  ","i ","   "," e",null,"Proprietary",null,true,"Yes","12-Eco PowPak Spec Submittal",null,"y","12p1: \"using Lutron®Clear Connect® RF Technology\"",null,"",{"$f":"IF(ISNA(MATCH(A162, Application.!A:A, 0)), \"\", MATCH(A162, Application.!A:A, 0))","v":174}]
[163,"  ","i ","   "," e",null,"Other",null,false,"No",null,null,null,null,null,"",{"$f":"IF(ISNA(MATCH(A163, Application.!A:A, 0)), \"\", MATCH(A163, Application.!A:A, 0))","v":175}]
[164,"  ","i ","   "," e",null,"Notes about \"Proprietary\" or \"Other\":",null,null,{"$f":"H164","v":0},null,null,null,null,null,"",{"$f":"IF(ISNA(MATCH(A164, Application.!A:A, 0)), \"\", MATCH(A164, Application.!A:A, 0))","v":176}]
[165,"  \n ","i \n ","   \n "," e\n ","What modes of operation provide continuous dimming according to the definition above? ",null,"Select all that apply",null,null,null,null,null,null,null,156,{"$f":"IF(ISNA(MATCH(A165, Application.!A:A, 0)), \"\", MATCH(A165, Application.!A:A, 0))","v":177}]
[166,"  ","i ","   "," e",null,"Occupancy sensing",null,true,{"$f":"IF(I166=TRUE,\"Yes\", \"No\")","v":"Yes"},"06-Wireless Occ Sensor Spec Submittal",null,"y",null,null,157,{"$f":"IF(ISNA(MATCH(A166, Application.!A:A, 0)), \"\", MATCH(A166, Application.!A:A, 0))","v":178}]
[167,"  ","i ","   "," e",null,"Daylight harvesting / photocell control",null,true,"Yes","08-Wireless Daylight Sensor Spec Submittal",null,"y",null,null,158,{"$f":"IF(ISNA(MATCH(A167, Application.!A:A, 0)), \"\", MATCH(A167, Application.!A:A, 0))","v":179}]
[168,"  ","i ","   "," e",null,"High-End Trim",null,true,"Yes","01-Programming Guide, Page 20",null,"y",null,null,159,{"$f":"IF(ISNA(MATCH(A168, Application.!A:A, 0)), \"\", MATCH(A168, Application.!A:A, 0))","v":180}]
[169,"  ","i ","   ",null,null,"Personal Control",null,true,"Yes","18-Pico Wireless Control Spec Submittal",null,"y",null,null,160,{"$f":"IF(ISNA(MATCH(A169, Application.!A:A, 0)), \"\", MATCH(A169, Application.!A:A, 0))","v":181}]
[170,"   \n ","i  \n ","    \n "," e \n ","What dimming curve(s) does the control system (not the luminaire/driver) use? ",null,"Select all that apply",null,null,null,null,null,null,null,161,{"$f":"IF(ISNA(MATCH(A170, Application.!A:A, 0)), \"\", MATCH(A170, Application.!A:A, 0))","v":182}]
[171,"  ","i ","   "," e",null,"Linear",null,true,"Yes","13-0-10V Control Topology, Page 2",null,"y",null,null,162,{"$f":"IF(ISNA(MATCH(A171, Application.!A:A, 0)), \"\", MATCH(A171, Application.!A:A, 0))","v":183}]
[172,"  ","i ","   "," e",null,"Logarithmic",null,false,"No",null,null,null,null,null,163,{"$f":"IF(ISNA(MATCH(A172, Application.!A:A, 0)), \"\", MATCH(A172, Application.!A:A, 0))","v":184}]
[173,"  ","i ","   "," e",null,"Proprietary",null,false,"No",null,null,null,null,null,164,{"$f":"IF(ISNA(MATCH(A173, Application.!A:A, 0)), \"\", MATCH(A173, Application.!A:A, 0))","v":185}]
[174,"  ","i ","   "," e","What dimming standards, if any, does the product comply with? ",null,"Select all that apply",null,null,null,null,null,null,null,168,{"$f":"IF(ISNA(MATCH(A174, Application.!A:A, 0)), \"\", MATCH(A174, Application.!A:A, 0))","v":186}]
[175,"  ","i ","   "," e",null,"ANSI C82.11-2011",null,false,"No",null,null,null,null,null,169,{"$f":"IF(ISNA(MATCH(A175, Application.!A:A, 0)), \"\", MATCH(A175, Application.!A:A, 0))","v":187}]
[176,"  ","i ","   "," e",null,"DALI V1 IEC 62386",null,false,"No",null,null,null,null,null,"",{"$f":"IF(ISNA(MATCH(A176, Application.!A:A, 0)), \"\", MATCH(A176, Application.!A:A, 0))","v":188}]
[177,"  ","i ","   "," e",null,"DALI V2 IEC 62386",null,false,"No",null,null,null,null,null,"",{"$f":"IF(ISNA(MATCH(A177, Application.!A:A, 0)), \"\", MATCH(A177, Application.!A:A, 0))","v":189}]
[178,"  ","i ","   "," e",null,"DMX512",null,false,"No",null,null,null,null,null,171,{"$f":"IF(ISNA(MATCH(A178, Application.!A:A, 0)), \"\", MATCH(A178, Application.!A:A, 0))","v":190}]
[179,"  ","i ","   "," e",null,"DMX512A",null,false,"No",null,null,null,null,null,172,{"$f":"IF(ISNA(MATCH(A179, Application.!A:A, 0)), \"\", MATCH(A179, Application.!A:A, 0))","v":197}]
[180,"  ","i ","   "," e",null,"ESTA E1.3",null,false,"No",null,null,null,null,null,173,{"$f":"IF(ISNA(MATCH(A180, Application.!A:A, 0)), \"\", MATCH(A180, Application.!A:A, 0))","v":198}]
[181,"  ","i ","   "," e",null,"IEC60929 Annex E (0-10V)",null,true,"Yes","03-0-10V PowPak Spec Submittal, Page 3, 0 –10 V- Control Link #6",null,"y","03p3: \"Compatible with ANSI E1.3 2001 (R2006), IEC 60929 Annex E\"",null,174,{"$f":"IF(ISNA(MATCH(A181, Application.!A:A, 0)), \"\", MATCH(A181, Application.!A:A, 0))","v":199}]
[182,"  ","i ","   "," e",null,"NEMA 410-2011 ",null,true,"Yes","13-0-10V Control Topology, Page 2",null,"y",null,null,175,{"$f":"IF(ISNA(MATCH(A182, Application.!A:A, 0)), \"\", MATCH(A182, Application.!A:A, 0))","v":200}]
[183,"  ","i ","   "," e",null,"NEMA 410-2015",null,false,"No",null,null,null,null,null,"",{"$f":"IF(ISNA(MATCH(A183, Application.!A:A, 0)), \"\", MATCH(A183, Application.!A:A, 0))","v":201}]
[184,"  ","i ","   "," e",null,"NEMA SSL-7A-2013 ",null,false,"No",null,null,null,null,null,176,{"$f":"IF(ISNA(MATCH(A184, Application.!A:A, 0)), \"\", MATCH(A184, Application.!A:A, 0))","v":202}]
[185,"  ","i ","   "," e",null,"IEEE PAR1789",null,false,"No",null,null,null,null,null,177,{"$f":"IF(ISNA(MATCH(A185, Application.!A:A, 0)), \"\", MATCH(A185, Application.!A:A, 0))","v":203}]
[186,"  ","i ","   "," e",null,"Zigbee",null,false,"No",null,null,null,null,null,"",{"$f":"IF(ISNA(MATCH(A186, Application.!A:A, 0)), \"\", MATCH(A186, Application.!A:A, 0))","v":204}]
[187,"  ","i ","   "," e",null,"Zigbee Light Link",null,false,"No",null,null,null,null,null,"",{"$f":"IF(ISNA(MATCH(A187, Application.!A:A, 0)), \"\", MATCH(A187, Application.!A:A, 0))","v":205}]
[188,"  ","i ","   "," e",null,"Other",null,false,"No",null,null,null,null,null,"",{"$f":"IF(ISNA(MATCH(A188, Application.!A:A, 0)), \"\", MATCH(A188, Application.!A:A, 0))","v":206}]
[189,"  ","i ","   "," e",null,"Notes about \"Other\":",null,null,{"$f":"H189","v":0},null,null,null,null,null,178,{"$f":"IF(ISNA(MATCH(A189, Application.!A:A, 0)), \"\", MATCH(A189, Application.!A:A, 0))","v":207}]
[190,"I ","  ","E","   ","8)","Continuous Dimming",null,null,null,null,null,null,null,null,179,{"$f":"IF(ISNA(MATCH(A190, Application.!A:A, 0)), \"\", MATCH(A190, Application.!A:A, 0))","v":208}]
[191,"  ","i ","   ",null,"9)","Control Persistence",null,null,null,null,null,null,null,null,180,{"$f":"IF(ISNA(MATCH(A191, Application.!A:A, 0)), \"\", MATCH(A191, Application.!A:A, 0))","v":209}]
[192,"  \n  \n \n \n \n","i \n  \n \n \n \n","   \n  \n \n \n \n",null,"The capability of a networked lighting control system’s lowest-level (“edge device”) luminaire controllers to execute three pre-programmed energy saving strategies (occupancy sensing, daylight harvesting, and high-end trim) on a \"room level\", or finer, in the absence of  communications with the next higher networked element in the system’s topology. ",null,null,null,null,null,null,null,null,null,181,{"$f":"IF(ISNA(MATCH(A192, Application.!A:A, 0)), \"\", MATCH(A192, Application.!A:A, 0))","v":210}]
[193,"  \n ","i \n ","   \n ",null,"Does the system have the capability for control persistence as defined above?",null,null,true,{"$f":"IF(I193=TRUE,\"Yes\", \"No\")","v":"Yes"},"05-Brochure, Page 5.  and followup from review. Doc 25 emailed",null,"y","please provide document and citation where the functionality in question is specifically referenced and claim can be verified","p.5 describes these functions, without the hub.  Hub is optional.  Explained in review.  No doc says this explicitly.  The Cx tool can setup system without a hub installed at all.  Or hub can lose connection. ",182,{"$f":"IF(ISNA(MATCH(A193, Application.!A:A, 0)), \"\", MATCH(A193, Application.!A:A, 0))","v":212}]
[194,"   \n\n ","i  \n\n ","    \n\n ",null,"If yes, what energy savings strategies can be executed without connection or due to failure of connection to higher level networked elements?",null,"Select all that apply",null,null,null,null,null,null,null,183,{"$f":"IF(ISNA(MATCH(A194, Application.!A:A, 0)), \"\", MATCH(A194, Application.!A:A, 0))","v":213}]
[195,"  ","i ","   ",null,null,"Occupancy sensing",null,true,{"$f":"IF(I195=TRUE,\"Yes\", \"No\")","v":"Yes"},"05-Brochure, Page 5.  and followup from review.  Doc 25 emailed",null,"y",null,null,184,{"$f":"IF(ISNA(MATCH(A195, Application.!A:A, 0)), \"\", MATCH(A195, Application.!A:A, 0))","v":214}]
[196,"  ","i ","   ",null,null,"Daylight harvesting",null,true,{"$f":"IF(I196=TRUE,\"Yes\", \"No\")","v":"Yes"},"05-Brochure, Page 5.  and followup from review. Doc 25 emailed",null,"y",null,null,185,{"$f":"IF(ISNA(MATCH(A196, Application.!A:A, 0)), \"\", MATCH(A196, Application.!A:A, 0))","v":215}]
[197,"  ","i ","   ",null,null,"High end trim/ task tuning",null,true,{"$f":"IF(I197=TRUE,\"Yes\", \"No\")","v":"Yes"},"05-Brochure, Page 5.  and followup from review.",null,"y",null,null,186,{"$f":"IF(ISNA(MATCH(A197, Application.!A:A, 0)), \"\", MATCH(A197, Application.!A:A, 0))","v":216}]
[198,"  ","i ","   ",null,null,"Personal control",null,true,{"$f":"IF(I198=TRUE,\"Yes\", \"No\")","v":"Yes"},"05-Brochure, Page 5.  and followup from review.  Doc 25 emailed",null,"y","pico remote control, or local switch","browser is mainly maintenance, facil mgr. and Cx.  each occupant personal control is usually pico, not browser.",187,{"$f":"IF(ISNA(MATCH(A198, Application.!A:A, 0)), \"\", MATCH(A198, Application.!A:A, 0))","v":217}]
[199,"  ","i ","   ",null,null,"Local Manual Switch",null,true,{"$f":"IF(I199=TRUE,\"Yes\", \"No\")","v":"Yes"},"05-Brochure, Page 5.  and followup from review.",null,"y",null,null,188,{"$f":"IF(ISNA(MATCH(A199, Application.!A:A, 0)), \"\", MATCH(A199, Application.!A:A, 0))","v":218}]
[200,"  ","i ","   ",null,"9)","Control Persistence",null,null,null,null,null,null,null,null,194,{"$f":"IF(ISNA(MATCH(A200, Application.!A:A, 0)), \"\", MATCH(A200, Application.!A:A, 0))","v":219}]
[201,"  ","i ","E","   ","10)","Scheduling",null,null,null,null,null,null,null,null,195,{"$f":"IF(ISNA(MATCH(A201, Application.!A:A, 0)), \"\", MATCH(A201, Application.!A:A, 0))","v":220}]
[202," \n \n  \n \n \n"," \n \n  \n \n \n"," \n \n  \n \n \n"," \n \n  \n \n \n","Definition:  The capability to automatically affect the operation of lighting equipment based on time of day.  Scheduling capability is Reported for Interior systems and Required for Exterior systems.\nExterior systems are required to have event scheduling, and \"astronomical\" scheduling functionality for sunrise and sunset programming, based on geographical location and time of year. ",null,null,null,null,null,null,null,null,null,196,{"$f":"IF(ISNA(MATCH(A202, Application.!A:A, 0)), \"\", MATCH(A202, Application.!A:A, 0))","v":221}]
[203,"  ","i ","E","   ","Does the system have scheduling capability?",null,null,true,{"$f":"IF(I203=TRUE,\"Yes\", \"No\")","v":"Yes"},"01-Programming Guide, Pages 25 thru 27",null,"y",null,null,197,{"$f":"IF(ISNA(MATCH(A203, Application.!A:A, 0)), \"\", MATCH(A203, Application.!A:A, 0))","v":222}]
[204,"  ","i ","E","   ","Does the system use an astronomical time-clock for scheduling?",null,null,true,"Yes","01-Programming Guide, Page 26, Create Schedule #4",null,"y",null,null,198,{"$f":"IF(ISNA(MATCH(A204, Application.!A:A, 0)), \"\", MATCH(A204, Application.!A:A, 0))","v":223}]
[205,null,"i ","E",null,"Does the system provide holiday and special schedule programming? ",null,null,false,"No",null,null,null,null,null,205,{"$f":"IF(ISNA(MATCH(A205, Application.!A:A, 0)), \"\", MATCH(A205, Application.!A:A, 0))","v":224}]
[206,"  ","i ","   "," e","How far ahead can events be scheduled (pick one)",null,null,null,null,null,null,null,null,null,199,{"$f":"IF(ISNA(MATCH(A206, Application.!A:A, 0)), \"\", MATCH(A206, Application.!A:A, 0))","v":225}]
[207,"  ","i ","   "," e",null,"A day",null,false,"No",null,null,null,null,null,200,{"$f":"IF(ISNA(MATCH(A207, Application.!A:A, 0)), \"\", MATCH(A207, Application.!A:A, 0))","v":226}]
[208,"  ","i ","   "," e",null,"A week",null,false,"No","The scheduling can be adjusted by day on a weekly basis.  For holidays, a change can be made for a specific day of the week where the holiday falls and it will return to normal operation the following day.  It should then be re-programmed to normal operation before the following week.",null,null,null,null,201,{"$f":"IF(ISNA(MATCH(A208, Application.!A:A, 0)), \"\", MATCH(A208, Application.!A:A, 0))","v":227}]
[209,"  ","i ","   "," e",null,"A year",null,false,"No",null,null,null,null,null,202,{"$f":"IF(ISNA(MATCH(A209, Application.!A:A, 0)), \"\", MATCH(A209, Application.!A:A, 0))","v":228}]
[210,"  ","i ","   "," e",null,"No limit",null,false,"No","01-Programming Guide, Page 26, Create Schedule #4\n",null,null,"please provide document and citation where the functionality in question is specifically referenced and claim can be verified","Can program one week, that recurs indefinitely.",203,{"$f":"IF(ISNA(MATCH(A210, Application.!A:A, 0)), \"\", MATCH(A210, Application.!A:A, 0))","v":229}]
[211,"  ","i ","   "," e",null,"Other (explain)","A week, that can recur indefinitely",null,{"$f":"H211","v":"A week, that can recur indefinitely"},null,null,"y",null,null,204,{"$f":"IF(ISNA(MATCH(A211, Application.!A:A, 0)), \"\", MATCH(A211, Application.!A:A, 0))","v":230}]
[212,"  \n ","i \n ","   \n "," e\n ","Does the system provide the capability to override scheduling via a local override switch?",null,"Yes",true,"Yes","02-Hub Spec Submittal, A Pico Wireless remote will override the levels set by a timeclock event.  Also 25-email",null,"y",null,"maybe not documented.  Will add email",206,{"$f":"IF(ISNA(MATCH(A212, Application.!A:A, 0)), \"\", MATCH(A212, Application.!A:A, 0))","v":231}]
[213,"  \n ","i \n ","   \n "," e\n ","Does the system provide the capability to layer with other control strategies by timer or priority? ",null,"Yes",true,"Yes","Timeclock events can adjust the settings on occupancy sensors such as occupied & unoccupied levels",null,"y","05p5: \"Combine lighting control strategies to maximize efficiency\"",null,207,{"$f":"IF(ISNA(MATCH(A213, Application.!A:A, 0)), \"\", MATCH(A213, Application.!A:A, 0))","v":232}]
[214,"  ","i ","E","   ","10)","Scheduling",null,null,null,null,null,null,null,null,208,{"$f":"IF(ISNA(MATCH(A214, Application.!A:A, 0)), \"\", MATCH(A214, Application.!A:A, 0))","v":233}]
[215,"  ","i ","   "," e","11)","Energy Monitoring",null,null,null,null,null,null,null,null,209,{"$f":"IF(ISNA(MATCH(A215, Application.!A:A, 0)), \"\", MATCH(A215, Application.!A:A, 0))","v":234}]
[216,"\n \n \n \n  \n \n","\n \n \n \n  \n \n","\n \n \n \n  \n \n","\n \n \n \n  \n \n","Definition:  The ability of a system, luminaire, or device to report its own energy consumption, or the energy consumption of any controlled device via direct measurement or other methodology. The method by which the system implements this capability must be clearly described. The sampling frequency and accuracy of reported data must be specified.  ",null,null,null,null,null,null,null,null,null,210,{"$f":"IF(ISNA(MATCH(A216, Application.!A:A, 0)), \"\", MATCH(A216, Application.!A:A, 0))","v":235}]
[217,"  ","i ","   "," e","Does the system have Energy Monitoring capability?",null,null,true,{"$f":"IF(I217=TRUE,\"Yes\", \"No\")","v":"Yes"},"01-Programming Guide, Page 33",null,"y",null,null,211,{"$f":"IF(ISNA(MATCH(A217, Application.!A:A, 0)), \"\", MATCH(A217, Application.!A:A, 0))","v":236}]
[218,"  ","i ","   "," e","What is the methodology(s)? ",null,"Select all that apply",null,null,null,null,null,null,null,212,{"$f":"IF(ISNA(MATCH(A218, Application.!A:A, 0)), \"\", MATCH(A218, Application.!A:A, 0))","v":237}]
[219,"  ","i ","   "," e",null,"True power meter (current and voltage)",null,true,"Yes","12-Eco PowPak Spec Submittal, 02-Hub Spec Submittal",null,"y","02p3: \"Measured energy data for PowPak Wireless Fixture Control accurate to ±2%, or 0.5 W, whichever is higher.\"","this is individual fixture control",213,{"$f":"IF(ISNA(MATCH(A219, Application.!A:A, 0)), \"\", MATCH(A219, Application.!A:A, 0))","v":238}]
[220,"  ","i ","   "," e",null,"Current meter with nominal voltage",null,false,"No",null,null,null,null,null,214,{"$f":"IF(ISNA(MATCH(A220, Application.!A:A, 0)), \"\", MATCH(A220, Application.!A:A, 0))","v":239}]
[221,"  ","i ","   "," e",null,"On/off/dim status with wattage look up table",null,true,"Yes",null,null,"y","01p33: \"View energy savings information. This is more accurate if fixture wattage is entered into the system for each device.\"  Does the system also use wattage look up tables (Calculated)?","circuit level is calculated, for now.  Zone level.  If no power pack for every fixture",215,{"$f":"IF(ISNA(MATCH(A221, Application.!A:A, 0)), \"\", MATCH(A221, Application.!A:A, 0))","v":240}]
[222,"  ","i ","   "," e",null,"On/off status with wattage look up table",null,true,"Yes",null,null,"y","See N221","have switching modules 222 and dimming modules 221",216,{"$f":"IF(ISNA(MATCH(A222, Application.!A:A, 0)), \"\", MATCH(A222, Application.!A:A, 0))","v":241}]
[223,"  ","i ","   "," e",null,"Other (explain)","Calculated power",null,{"$f":"H223","v":"Calculated power"},"02-Hub Spec Submittal",null,"y","02p3: \"Calculated energy data for PowPak modules and Maestro dimmers or switches at 10% accuracy.\"",null,217,{"$f":"IF(ISNA(MATCH(A223, Application.!A:A, 0)), \"\", MATCH(A223, Application.!A:A, 0))","v":242}]
[224,"  ","i ","   "," e","If metered, where is the meter located? ",null,"Select all that apply",null,null,null,null,null,null,null,218,{"$f":"IF(ISNA(MATCH(A224, Application.!A:A, 0)), \"\", MATCH(A224, Application.!A:A, 0))","v":243}]
[225,"  ","i ","   "," e",null,"Integral in driver or ballast",null,false,"No",null,null,null,null,null,219,{"$f":"IF(ISNA(MATCH(A225, Application.!A:A, 0)), \"\", MATCH(A225, Application.!A:A, 0))","v":244}]
[226,"  ","i ","   "," e",null,"Integral in control module at luminaire",null,true,"Yes","12-Eco PowPak Spec Submittal, Page 6, Power/Load #2",null,"y","12p6: \"Power measurement: Accurate to ±2%, or 0.5 W, whichever is higher\"",null,220,{"$f":"IF(ISNA(MATCH(A226, Application.!A:A, 0)), \"\", MATCH(A226, Application.!A:A, 0))","v":245}]
[227,"  ","i ","   "," e",null,"Integral in sensor module",null,false,"No",null,null,null,null,null,221,{"$f":"IF(ISNA(MATCH(A227, Application.!A:A, 0)), \"\", MATCH(A227, Application.!A:A, 0))","v":246}]
[228,"  ","i ","   "," e",null,"Integral in switch",null,false,"No",null,null,null,null,null,222,{"$f":"IF(ISNA(MATCH(A228, Application.!A:A, 0)), \"\", MATCH(A228, Application.!A:A, 0))","v":247}]
[229,"  ","i ","   "," e",null,"Circuit at electrical panel",null,false,"No",null,null,null,null,null,223,{"$f":"IF(ISNA(MATCH(A229, Application.!A:A, 0)), \"\", MATCH(A229, Application.!A:A, 0))","v":248}]
[230,"  ","i ","   "," e",null,"Plugload sensor",null,false,"No",null,null,null,null,null,224,{"$f":"IF(ISNA(MATCH(A230, Application.!A:A, 0)), \"\", MATCH(A230, Application.!A:A, 0))","v":249}]
[231,"  ","i ","   "," e",null,"Other (explain)",null,null,{"$f":"H231","v":0},null,null,null,null,null,225,{"$f":"IF(ISNA(MATCH(A231, Application.!A:A, 0)), \"\", MATCH(A231, Application.!A:A, 0))","v":250}]
[232,"  ","i ","   "," e","If metered, what is the meter accuracy?",null,"Enter number or \"NA\"",null,null,null,null,null,null,null,226,{"$f":"IF(ISNA(MATCH(A232, Application.!A:A, 0)), \"\", MATCH(A232, Application.!A:A, 0))","v":256}]
[233,"  ","i ","   "," e",null,"At energy levels of ____% and above:","NA",null,{"$f":"H233","v":"NA"},null,null,"y",null,null,"",{"$f":"IF(ISNA(MATCH(A233, Application.!A:A, 0)), \"\", MATCH(A233, Application.!A:A, 0))","v":257}]
[234,"  ","i ","   "," e",null,"+/-____% Power at zone/luminaire, ",2,null,{"$f":"H234","v":2},"12-Eco PowPak Spec Submittal, 02-Hub Spec Submittal",null,"y",null,null,"",{"$f":"IF(ISNA(MATCH(A234, Application.!A:A, 0)), \"\", MATCH(A234, Application.!A:A, 0))","v":258}]
[235,"  ","i ","   "," e",null,"+/-____ % Energy at room/area.","NA",null,"NA",null,null,"y",null,null,"",{"$f":"IF(ISNA(MATCH(A235, Application.!A:A, 0)), \"\", MATCH(A235, Application.!A:A, 0))","v":259}]
[236,"  ","i ","   "," e",null,"At energy levels of ____% and below: ","NA",null,"NA",null,null,"y",null,null,"",{"$f":"IF(ISNA(MATCH(A236, Application.!A:A, 0)), \"\", MATCH(A236, Application.!A:A, 0))","v":260}]
[237,"  ","i ","   "," e",null,"+/-____ % Power at zone/luminaire, ","NA",null,"NA",null,null,"y",null,null,"",{"$f":"IF(ISNA(MATCH(A237, Application.!A:A, 0)), \"\", MATCH(A237, Application.!A:A, 0))","v":261}]
[238,"  ","i ","   "," e",null,"+/-____% Energy at room/area.","NA",null,"NA",null,null,"y",null,null,"",{"$f":"IF(ISNA(MATCH(A238, Application.!A:A, 0)), \"\", MATCH(A238, Application.!A:A, 0))","v":262}]
[239,"  ","i ","   "," e","What is the sampling frequency?",null,"Enter number or \"NA\"",null,null,null,null,null,null,null,227,{"$f":"IF(ISNA(MATCH(A239, Application.!A:A, 0)), \"\", MATCH(A239, Application.!A:A, 0))","v":263}]
[240,"  ","i ","   "," e",null,"Sampled at ____ seconds.","NA",null,"NA",null,null,"y",null,null,228,{"$f":"IF(ISNA(MATCH(A240, Application.!A:A, 0)), \"\", MATCH(A240, Application.!A:A, 0))","v":264}]
[241,"  ","i ","   "," e",null,"Aggregated to _____ second intervals.","NA",null,"NA",null,null,"y",null,null,"",{"$f":"IF(ISNA(MATCH(A241, Application.!A:A, 0)), \"\", MATCH(A241, Application.!A:A, 0))","v":265}]
[242,"  ","i ","   "," e",null,"Aggregated to _____ minute intervals.","NA",null,"NA",null,null,"y",null,null,231,{"$f":"IF(ISNA(MATCH(A242, Application.!A:A, 0)), \"\", MATCH(A242, Application.!A:A, 0))","v":266}]
[243,"\n","i ","   "," e","How long is the aggregated energy data available in the system?  For instance, is it deleted after a week, or 30 days, or a year?",null,"Not Available",null,"Not Available",null,null,"y",null,null,232,{"$f":"IF(ISNA(MATCH(A243, Application.!A:A, 0)), \"\", MATCH(A243, Application.!A:A, 0))","v":267}]
[244,"  ","i ","   "," e","What is the smallest spatial resolution of the data record? Choose one.",null,"Per luminaire",null,{"$f":"H244","v":"Per luminaire"},"12-Eco PowPak Spec Submittal",null,"y",null,null,233,{"$f":"IF(ISNA(MATCH(A244, Application.!A:A, 0)), \"\", MATCH(A244, Application.!A:A, 0))","v":268}]
[245,"  \n ","i \n ","   \n "," e\n ","Is energy data of the whole system available at a central location, (rather than local data available locally at each device?)",null,null,true,{"$f":"IF(I245=TRUE,\"Yes\", \"No\")","v":"Yes"},"02-Hub Spec Submittal.  P.2",null,"y",null,"Is there documentation or screen captures that can be used to verify this claim?",241,{"$f":"IF(ISNA(MATCH(A245, Application.!A:A, 0)), \"\", MATCH(A245, Application.!A:A, 0))","v":269}]
[246,"  ","i ","   "," e","Is optional hardware or software needed for energy monitoring?",null,null,false,"No",null,null,null,null,null,242,{"$f":"IF(ISNA(MATCH(A246, Application.!A:A, 0)), \"\", MATCH(A246, Application.!A:A, 0))","v":270}]
[247,"  ","i ","   "," e",null,"If so, what equipment is needed?",null,null,{"$f":"H247","v":0},null,null,null,null,null,243,{"$f":"IF(ISNA(MATCH(A247, Application.!A:A, 0)), \"\", MATCH(A247, Application.!A:A, 0))","v":271}]
[248,null,"i  "," "," e","What data is available from energy monitoring, in a file download?",null,null,null,null,null,null,null,null,"no file output from dashboard.  Maybe thru 3rd party bacnet",244,{"$f":"IF(ISNA(MATCH(A248, Application.!A:A, 0)), \"\", MATCH(A248, Application.!A:A, 0))","v":272}]
[249,"  ","i ","   "," e",null,"Interval Data","Select all that apply",null,null,null,null,null,null,null,245,{"$f":"IF(ISNA(MATCH(A249, Application.!A:A, 0)), \"\", MATCH(A249, Application.!A:A, 0))","v":273}]
[250,"  ","i ","   "," e",null,"    Current ",null,false,"No",null,null,null,null,null,248,{"$f":"IF(ISNA(MATCH(A250, Application.!A:A, 0)), \"\", MATCH(A250, Application.!A:A, 0))","v":274}]
[251,"  ","i ","   "," e",null,"    Energy ",null,true,"Yes","14-bacnet p3,4",null,"y",null,null,249,{"$f":"IF(ISNA(MATCH(A251, Application.!A:A, 0)), \"\", MATCH(A251, Application.!A:A, 0))","v":275}]
[252,"  ","i ","   "," e",null,"    Line frequency ",null,false,"No",null,null,null,null,null,250,{"$f":"IF(ISNA(MATCH(A252, Application.!A:A, 0)), \"\", MATCH(A252, Application.!A:A, 0))","v":276}]
[253,"  ","i ","   "," e",null,"    Luminaire % light output",null,true,"Yes","14-bacnet p3,4",null,"y",null,null,251,{"$f":"IF(ISNA(MATCH(A253, Application.!A:A, 0)), \"\", MATCH(A253, Application.!A:A, 0))","v":277}]
[254,"  ","i ","   "," e",null,"    Luminaire % power",null,false,"No",null,null,null,null,null,252,{"$f":"IF(ISNA(MATCH(A254, Application.!A:A, 0)), \"\", MATCH(A254, Application.!A:A, 0))","v":278}]
[255,"  ","i ","   "," e",null,"    Occupancy",null,true,"Yes","14-bacnet p3,4",null,"y",null,null,253,{"$f":"IF(ISNA(MATCH(A255, Application.!A:A, 0)), \"\", MATCH(A255, Application.!A:A, 0))","v":279}]
[256,"  ","i ","   "," e",null,"    Photosensor ",null,false,"No",null,null,null,null,null,254,{"$f":"IF(ISNA(MATCH(A256, Application.!A:A, 0)), \"\", MATCH(A256, Application.!A:A, 0))","v":282}]
[257,"  ","i ","   "," e",null,"    Power",null,true,"Yes","14-bacnet p3,4",null,"y",null,null,255,{"$f":"IF(ISNA(MATCH(A257, Application.!A:A, 0)), \"\", MATCH(A257, Application.!A:A, 0))","v":283}]
[258,"  ","i ","   "," e",null,"    Power, Apparent",null,false,"No",null,null,null,null,null,256,{"$f":"IF(ISNA(MATCH(A258, Application.!A:A, 0)), \"\", MATCH(A258, Application.!A:A, 0))","v":284}]
[259,"  ","i ","   "," e",null,"    Power, Real",null,false,"No",null,null,null,null,null,257,{"$f":"IF(ISNA(MATCH(A259, Application.!A:A, 0)), \"\", MATCH(A259, Application.!A:A, 0))","v":285}]
[260,"  ","i ","   "," e",null,"    Power, Reactive",null,false,"No",null,null,null,null,null,258,{"$f":"IF(ISNA(MATCH(A260, Application.!A:A, 0)), \"\", MATCH(A260, Application.!A:A, 0))","v":286}]
[261,"  ","i ","   "," e",null,"    Power factor",null,false,"No",null,null,null,null,null,259,{"$f":"IF(ISNA(MATCH(A261, Application.!A:A, 0)), \"\", MATCH(A261, Application.!A:A, 0))","v":287}]
[262,"  ","i ","   "," e",null,"    THD (Total Harmonic Distortion)",null,false,"No",null,null,null,null,null,260,{"$f":"IF(ISNA(MATCH(A262, Application.!A:A, 0)), \"\", MATCH(A262, Application.!A:A, 0))","v":288}]
[263,"  ","i ","   "," e",null,"    Voltage",null,false,"No",null,null,null,null,null,261,{"$f":"IF(ISNA(MATCH(A263, Application.!A:A, 0)), \"\", MATCH(A263, Application.!A:A, 0))","v":289}]
[264,"  ","i ","   "," e",null,"    Other (explain)","available through 3rd party BACnet integration",null,{"$f":"H264","v":"available through 3rd party BACnet integration"},"14-bacnet p3,4",null,"y",null,null,264,{"$f":"IF(ISNA(MATCH(A264, Application.!A:A, 0)), \"\", MATCH(A264, Application.!A:A, 0))","v":290}]
[265,"  ","i ","   "," e",null,"Application Data","Select all that apply",null,null,null,null,null,null,null,265,{"$f":"IF(ISNA(MATCH(A265, Application.!A:A, 0)), \"\", MATCH(A265, Application.!A:A, 0))","v":291}]
[266,"  ","i ","   "," e",null,"    Building size (ft^2)",null,false,"No",null,null,null,null,null,266,{"$f":"IF(ISNA(MATCH(A266, Application.!A:A, 0)), \"\", MATCH(A266, Application.!A:A, 0))","v":292}]
[267,"  ","i ","   "," e",null,"    Building type (e.g. warehouse, school, office...)",null,false,"No",null,null,null,null,null,267,{"$f":"IF(ISNA(MATCH(A267, Application.!A:A, 0)), \"\", MATCH(A267, Application.!A:A, 0))","v":293}]
[268,"  ","i ","   "," e",null,"    Climate zone",null,false,"No",null,null,null,null,null,268,{"$f":"IF(ISNA(MATCH(A268, Application.!A:A, 0)), \"\", MATCH(A268, Application.!A:A, 0))","v":294}]
[269,"  ","i ","   "," e",null,"    Country",null,false,"No",null,null,null,null,null,269,{"$f":"IF(ISNA(MATCH(A269, Application.!A:A, 0)), \"\", MATCH(A269, Application.!A:A, 0))","v":295}]
[270,"  ","i ","   "," e",null,"    Luminaire type ",null,false,"No",null,null,null,null,null,270,{"$f":"IF(ISNA(MATCH(A270, Application.!A:A, 0)), \"\", MATCH(A270, Application.!A:A, 0))","v":296}]
[271,"  ","i ","   "," e",null,"    Luminaire wattage (new)",null,false,"No",null,null,null,null,null,271,{"$f":"IF(ISNA(MATCH(A271, Application.!A:A, 0)), \"\", MATCH(A271, Application.!A:A, 0))","v":297}]
[272,"  ","i ","   "," e",null,"    Luminaire wattage (previous)",null,false,"No",null,null,null,null,null,272,{"$f":"IF(ISNA(MATCH(A272, Application.!A:A, 0)), \"\", MATCH(A272, Application.!A:A, 0))","v":298}]
[273,"  ","i ","   "," e",null,"    Space type (e.g. corridor, conference room, bathroom…)",null,false,"No",null,null,null,null,null,273,{"$f":"IF(ISNA(MATCH(A273, Application.!A:A, 0)), \"\", MATCH(A273, Application.!A:A, 0))","v":300}]
[274,"  ","i ","   "," e",null,"    State or Province",null,false,"No",null,null,null,null,null,274,{"$f":"IF(ISNA(MATCH(A274, Application.!A:A, 0)), \"\", MATCH(A274, Application.!A:A, 0))","v":301}]
[275,"  ","i ","   "," e",null,"    Other (explain)",null,null,{"$f":"H275","v":0},null,null,null,null,null,275,{"$f":"IF(ISNA(MATCH(A275, Application.!A:A, 0)), \"\", MATCH(A275, Application.!A:A, 0))","v":304}]
[276,"  \n ","i \n ","   \n "," e\n ","What data is available from energy monitoring, on a GUI (Graphical User Interface)?",null,null,null,null,null,null,null,null,null,288,{"$f":"IF(ISNA(MATCH(A276, Application.!A:A, 0)), \"\", MATCH(A276, Application.!A:A, 0))","v":305}]
[277,"  ","i ","   "," e",null,"Interval Data","Select all that apply",null,null,null,null,null,null,null,289,{"$f":"IF(ISNA(MATCH(A277, Application.!A:A, 0)), \"\", MATCH(A277, Application.!A:A, 0))","v":306}]
[278,"  ","i ","   "," e",null,"    Current ",null,false,{"$f":"IF(I278=TRUE,\"Yes\", \"No\")","v":"No"},null,null,null,null,null,292,{"$f":"IF(ISNA(MATCH(A278, Application.!A:A, 0)), \"\", MATCH(A278, Application.!A:A, 0))","v":307}]
[279,"  ","i ","   "," e",null,"    Energy ",null,true,"Yes","01-Programming Guide, Page 33",null,"y","please provide document and citation where the functionality in question is specifically referenced and claim can be verified","scr",293,{"$f":"IF(ISNA(MATCH(A279, Application.!A:A, 0)), \"\", MATCH(A279, Application.!A:A, 0))","v":308}]
[280,"  ","i ","   "," e",null,"    Line frequency ",null,false,"No",null,null,null,null,null,294,{"$f":"IF(ISNA(MATCH(A280, Application.!A:A, 0)), \"\", MATCH(A280, Application.!A:A, 0))","v":309}]
[281,"  ","i ","   "," e",null,"    Luminaire % light output",null,false,"No",null,null,null,null,null,295,{"$f":"IF(ISNA(MATCH(A281, Application.!A:A, 0)), \"\", MATCH(A281, Application.!A:A, 0))","v":310}]
[282,"  ","i ","   "," e",null,"    Luminaire % power",null,false,"No",null,null,null,null,null,296,{"$f":"IF(ISNA(MATCH(A282, Application.!A:A, 0)), \"\", MATCH(A282, Application.!A:A, 0))","v":311}]
[283,"  ","i ","   "," e",null,"    Occupancy",null,true,"Yes","01-Programming Guide, Page 33",null,"y",null,null,297,{"$f":"IF(ISNA(MATCH(A283, Application.!A:A, 0)), \"\", MATCH(A283, Application.!A:A, 0))","v":312}]
[284,"  ","i ","   "," e",null,"    Photosensor ",null,false,"No",null,null,null,null,null,298,{"$f":"IF(ISNA(MATCH(A284, Application.!A:A, 0)), \"\", MATCH(A284, Application.!A:A, 0))","v":313}]
[285,"  ","i ","   "," e",null,"    Power",null,true,"Yes","01-Programming Guide, Page 33",null,"y","please provide document and citation where the functionality in question is specifically referenced and claim can be verified","Is this reporting power or energy?",299,{"$f":"IF(ISNA(MATCH(A285, Application.!A:A, 0)), \"\", MATCH(A285, Application.!A:A, 0))","v":314}]
[286,"  ","i ","   "," e",null,"    Power, Apparent",null,false,"No",null,null,null,null,null,300,{"$f":"IF(ISNA(MATCH(A286, Application.!A:A, 0)), \"\", MATCH(A286, Application.!A:A, 0))","v":315}]
[287,"  ","i ","   "," e",null,"    Power, Real",null,false,"No",null,null,null,null,null,301,{"$f":"IF(ISNA(MATCH(A287, Application.!A:A, 0)), \"\", MATCH(A287, Application.!A:A, 0))","v":317}]
[288,"  ","i ","   "," e",null,"    Power, Reactive",null,false,"No",null,null,null,null,null,302,{"$f":"IF(ISNA(MATCH(A288, Application.!A:A, 0)), \"\", MATCH(A288, Application.!A:A, 0))","v":318}]
[289,"  ","i ","   "," e",null,"    Power factor",null,false,"No",null,null,null,null,null,303,{"$f":"IF(ISNA(MATCH(A289, Application.!A:A, 0)), \"\", MATCH(A289, Application.!A:A, 0))","v":319}]
[290,"  ","i ","   "," e",null,"    THD (Total Harmonic Distortion)",null,false,"No",null,null,null,null,null,304,{"$f":"IF(ISNA(MATCH(A290, Application.!A:A, 0)), \"\", MATCH(A290, Application.!A:A, 0))","v":320}]
[291,"  ","i ","   "," e",null,"    Voltage",null,false,"No",null,null,null,null,null,305,{"$f":"IF(ISNA(MATCH(A291, Application.!A:A, 0)), \"\", MATCH(A291, Application.!A:A, 0))","v":321}]
[292,"  ","i ","   "," e",null,"    Other (explain)",null,null,{"$f":"H292","v":0},null,null,null,null,null,308,{"$f":"IF(ISNA(MATCH(A292, Application.!A:A, 0)), \"\", MATCH(A292, Application.!A:A, 0))","v":324}]
[293,"  ","i ","   "," e",null,"Application Data","Select all that apply",null,null,null,null,null,"technically a web base browser",null,309,{"$f":"IF(ISNA(MATCH(A293, Application.!A:A, 0)), \"\", MATCH(A293, Application.!A:A, 0))","v":325}]
[294,"  ","i ","   "," e",null,"    Building size (ft^2)",null,false,{"$f":"IF(I294=TRUE,\"Yes\", \"No\")","v":"No"},null,null,null,null,null,310,{"$f":"IF(ISNA(MATCH(A294, Application.!A:A, 0)), \"\", MATCH(A294, Application.!A:A, 0))","v":326}]
[295,"  ","i ","   "," e",null,"    Building type (e.g. warehouse, school, office...)",null,false,"No",null,null,null,null,null,311,{"$f":"IF(ISNA(MATCH(A295, Application.!A:A, 0)), \"\", MATCH(A295, Application.!A:A, 0))","v":327}]
[296,"  ","i ","   "," e",null,"    Climate zone",null,false,"No",null,null,null,null,null,312,{"$f":"IF(ISNA(MATCH(A296, Application.!A:A, 0)), \"\", MATCH(A296, Application.!A:A, 0))","v":328}]
[297,"  ","i ","   "," e",null,"    Country",null,false,"No",null,null,null,null,null,313,{"$f":"IF(ISNA(MATCH(A297, Application.!A:A, 0)), \"\", MATCH(A297, Application.!A:A, 0))","v":329}]
[298,"  ","i ","   "," e",null,"    Luminaire type ",null,false,"No",null,null,null,null,null,314,{"$f":"IF(ISNA(MATCH(A298, Application.!A:A, 0)), \"\", MATCH(A298, Application.!A:A, 0))","v":330}]
[299,"  ","i ","   "," e",null,"    Luminaire wattage (new)",null,true,"Yes",null,null,"y","01p33",null,315,{"$f":"IF(ISNA(MATCH(A299, Application.!A:A, 0)), \"\", MATCH(A299, Application.!A:A, 0))","v":331}]
[300,"  ","i ","   "," e",null,"    Luminaire wattage (previous)",null,false,"No",null,null,null,"01p33",null,316,{"$f":"IF(ISNA(MATCH(A300, Application.!A:A, 0)), \"\", MATCH(A300, Application.!A:A, 0))","v":332}]
[301,"  ","i ","   "," e",null,"    Space type (e.g. corridor, conference room, bathroom…)",null,true,"Yes",null,null,"y","01p33",null,317,{"$f":"IF(ISNA(MATCH(A301, Application.!A:A, 0)), \"\", MATCH(A301, Application.!A:A, 0))","v":333}]
[302,"  ","i ","   "," e",null,"    State or Province",null,false,"No",null,null,null,null,null,318,{"$f":"IF(ISNA(MATCH(A302, Application.!A:A, 0)), \"\", MATCH(A302, Application.!A:A, 0))","v":334}]
[303,"  ","i ","   "," e",null,"    Other (explain)",null,null,{"$f":"H303","v":0},null,null,null,null,null,319,{"$f":"IF(ISNA(MATCH(A303, Application.!A:A, 0)), \"\", MATCH(A303, Application.!A:A, 0))","v":335}]
[304,"   \n ","i  \n ","    \n "," e \n ","What data is available from energy monitoring, through an API (Application Program Interface)?",null,null,null,null,null,null,null,null,null,320,{"$f":"IF(ISNA(MATCH(A304, Application.!A:A, 0)), \"\", MATCH(A304, Application.!A:A, 0))","v":336}]
[305,"  ","i ","   "," e",null,"Interval Data","Select all that apply",null,null,null,null,null,null,null,321,{"$f":"IF(ISNA(MATCH(A305, Application.!A:A, 0)), \"\", MATCH(A305, Application.!A:A, 0))","v":337}]
[306,"  ","i ","   "," e",null,"    Current ",null,false,{"$f":"IF(I306=TRUE,\"Yes\", \"No\")","v":"No"},null,null,null,null,null,324,{"$f":"IF(ISNA(MATCH(A306, Application.!A:A, 0)), \"\", MATCH(A306, Application.!A:A, 0))","v":338}]
[307,"  ","i ","   "," e",null,"    Energy ",null,false,"No",null,null,null,null,null,325,{"$f":"IF(ISNA(MATCH(A307, Application.!A:A, 0)), \"\", MATCH(A307, Application.!A:A, 0))","v":339}]
[308,"  ","i ","   "," e",null,"    Line frequency ",null,false,"No",null,null,null,null,null,326,{"$f":"IF(ISNA(MATCH(A308, Application.!A:A, 0)), \"\", MATCH(A308, Application.!A:A, 0))","v":340}]
[309,"  ","i ","   "," e",null,"    Luminaire % light output",null,false,"No",null,null,null,null,null,327,{"$f":"IF(ISNA(MATCH(A309, Application.!A:A, 0)), \"\", MATCH(A309, Application.!A:A, 0))","v":341}]
[310,"  ","i ","   "," e",null,"    Luminaire % power",null,false,"No",null,null,null,null,null,328,{"$f":"IF(ISNA(MATCH(A310, Application.!A:A, 0)), \"\", MATCH(A310, Application.!A:A, 0))","v":342}]
[311,"  ","i ","   "," e",null,"    Occupancy",null,false,"No",null,null,null,null,null,329,{"$f":"IF(ISNA(MATCH(A311, Application.!A:A, 0)), \"\", MATCH(A311, Application.!A:A, 0))","v":343}]
[312,"  ","i ","   "," e",null,"    Photosensor ",null,false,"No",null,null,null,null,null,330,{"$f":"IF(ISNA(MATCH(A312, Application.!A:A, 0)), \"\", MATCH(A312, Application.!A:A, 0))","v":344}]
[313,"  ","i ","   "," e",null,"    Power",null,false,"No",null,null,null,null,null,331,{"$f":"IF(ISNA(MATCH(A313, Application.!A:A, 0)), \"\", MATCH(A313, Application.!A:A, 0))","v":345}]
[314,"  ","i ","   "," e",null,"    Power, Apparent",null,false,"No",null,null,null,null,null,332,{"$f":"IF(ISNA(MATCH(A314, Application.!A:A, 0)), \"\", MATCH(A314, Application.!A:A, 0))","v":346}]
[315,"  ","i ","   "," e",null,"    Power, Real",null,false,"No",null,null,null,null,null,333,{"$f":"IF(ISNA(MATCH(A315, Application.!A:A, 0)), \"\", MATCH(A315, Application.!A:A, 0))","v":347}]
[316,"  ","i ","   "," e",null,"    Power, Reactive",null,false,"No",null,null,null,null,null,334,{"$f":"IF(ISNA(MATCH(A316, Application.!A:A, 0)), \"\", MATCH(A316, Application.!A:A, 0))","v":348}]
[317,"  ","i ","   "," e",null,"    Power factor",null,false,"No",null,null,null,null,null,335,{"$f":"IF(ISNA(MATCH(A317, Application.!A:A, 0)), \"\", MATCH(A317, Application.!A:A, 0))","v":349}]
[318,"  ","i ","   "," e",null,"    THD (Total Harmonic Distortion)",null,false,"No",null,null,null,null,null,336,{"$f":"IF(ISNA(MATCH(A318, Application.!A:A, 0)), \"\", MATCH(A318, Application.!A:A, 0))","v":350}]
[319,"  ","i ","   "," e",null,"    Voltage",null,false,"No",null,null,null,null,null,337,{"$f":"IF(ISNA(MATCH(A319, Application.!A:A, 0)), \"\", MATCH(A319, Application.!A:A, 0))","v":351}]
[320,"  ","i ","   "," e",null,"    Other (explain)",null,null,{"$f":"H320","v":0},null,null,null,null,null,338,{"$f":"IF(ISNA(MATCH(A320, Application.!A:A, 0)), \"\", MATCH(A320, Application.!A:A, 0))","v":355}]
[321,"  ","i ","   "," e",null,"Application Data","Select all that apply",null,null,null,null,null,null,null,339,{"$f":"IF(ISNA(MATCH(A321, Application.!A:A, 0)), \"\", MATCH(A321, Application.!A:A, 0))","v":356}]
[322,"  ","i ","   "," e",null,"    Building size (ft^2)",null,false,{"$f":"IF(I322=TRUE,\"Yes\", \"No\")","v":"No"},null,null,null,null,null,340,{"$f":"IF(ISNA(MATCH(A322, Application.!A:A, 0)), \"\", MATCH(A322, Application.!A:A, 0))","v":357}]
[323,"  ","i ","   "," e",null,"    Building type (e.g. warehouse, school, office...)",null,false,"No",null,null,null,null,null,341,{"$f":"IF(ISNA(MATCH(A323, Application.!A:A, 0)), \"\", MATCH(A323, Application.!A:A, 0))","v":358}]
[324,"  ","i ","   "," e",null,"    Climate zone",null,false,"No",null,null,null,null,null,342,{"$f":"IF(ISNA(MATCH(A324, Application.!A:A, 0)), \"\", MATCH(A324, Application.!A:A, 0))","v":359}]
[325,"  ","i ","   "," e",null,"    Country",null,false,"No",null,null,null,null,null,343,{"$f":"IF(ISNA(MATCH(A325, Application.!A:A, 0)), \"\", MATCH(A325, Application.!A:A, 0))","v":360}]
[326,"  ","i ","   "," e",null,"    Luminaire type ",null,false,"No",null,null,null,null,null,344,{"$f":"IF(ISNA(MATCH(A326, Application.!A:A, 0)), \"\", MATCH(A326, Application.!A:A, 0))","v":361}]
[327,"  ","i ","   "," e",null,"    Luminaire wattage (new)",null,false,"No",null,null,null,null,null,345,{"$f":"IF(ISNA(MATCH(A327, Application.!A:A, 0)), \"\", MATCH(A327, Application.!A:A, 0))","v":362}]
[328,"  ","i ","   "," e",null,"    Luminaire wattage (previous)",null,false,"No",null,null,null,null,null,346,{"$f":"IF(ISNA(MATCH(A328, Application.!A:A, 0)), \"\", MATCH(A328, Application.!A:A, 0))","v":363}]
[329,"  ","i ","   "," e",null,"    Space type (e.g. corridor, conference room, bathroom…)",null,false,"No",null,null,null,null,null,347,{"$f":"IF(ISNA(MATCH(A329, Application.!A:A, 0)), \"\", MATCH(A329, Application.!A:A, 0))","v":364}]
[330,"  ","i ","   "," e",null,"    State or Province",null,false,"No",null,null,null,null,null,348,{"$f":"IF(ISNA(MATCH(A330, Application.!A:A, 0)), \"\", MATCH(A330, Application.!A:A, 0))","v":365}]
[331,"  ","i ","   "," e",null,"    Other (explain)",null,null,{"$f":"H331","v":0},null,null,null,null,null,349,{"$f":"IF(ISNA(MATCH(A331, Application.!A:A, 0)), \"\", MATCH(A331, Application.!A:A, 0))","v":366}]
[332,"  ","i ","   "," e","What is the format and content of the data output? ",null,"Select all that apply",null,null,null,null,null,null,null,276,{"$f":"IF(ISNA(MATCH(A332, Application.!A:A, 0)), \"\", MATCH(A332, Application.!A:A, 0))","v":367}]
[333,"  ","i ","   "," e",null,"CSV",null,false,"No",null,null,null,null,null,277,{"$f":"IF(ISNA(MATCH(A333, Application.!A:A, 0)), \"\", MATCH(A333, Application.!A:A, 0))","v":368}]
[334,"  ","i ","   "," e",null,".PDF",null,false,"No",null,null,null,null,null,278,{"$f":"IF(ISNA(MATCH(A334, Application.!A:A, 0)), \"\", MATCH(A334, Application.!A:A, 0))","v":369}]
[335,"  ","i ","   "," e",null,".PNG",null,false,"No",null,null,null,null,null,279,{"$f":"IF(ISNA(MATCH(A335, Application.!A:A, 0)), \"\", MATCH(A335, Application.!A:A, 0))","v":370}]
[336,"  ","i ","   "," e",null,".XLSX",null,false,"No",null,null,null,null,null,280,{"$f":"IF(ISNA(MATCH(A336, Application.!A:A, 0)), \"\", MATCH(A336, Application.!A:A, 0))","v":371}]
[337,"  ","i ","   "," e",null,"BACnet",null,true,"Yes","14-BACnet PICS, Pages 1 & 4",null,"y",null,null,"",{"$f":"IF(ISNA(MATCH(A337, Application.!A:A, 0)), \"\", MATCH(A337, Application.!A:A, 0))","v":372}]
[338,"  ","i ","   "," e",null,"gbXML 6.01",null,false,"No",null,null,null,null,null,"",{"$f":"IF(ISNA(MATCH(A338, Application.!A:A, 0)), \"\", MATCH(A338, Application.!A:A, 0))","v":373}]
[339,"  ","i ","   "," e",null,"Green Button",null,false,"No",null,null,null,null,null,281,{"$f":"IF(ISNA(MATCH(A339, Application.!A:A, 0)), \"\", MATCH(A339, Application.!A:A, 0))","v":374}]
[340,"  ","i ","   "," e",null,"Haystack",null,false,"No",null,null,null,null,null,283,{"$f":"IF(ISNA(MATCH(A340, Application.!A:A, 0)), \"\", MATCH(A340, Application.!A:A, 0))","v":375}]
[341,"  ","i ","   "," e",null,"hpXML BPI-2100-S-2013 1.1.1",null,false,"No",null,null,null,null,null,"",{"$f":"IF(ISNA(MATCH(A341, Application.!A:A, 0)), \"\", MATCH(A341, Application.!A:A, 0))","v":376}]
[342,"  ","i ","   "," e",null,"Niagara",null,false,"No",null,null,null,null,null,"",{"$f":"IF(ISNA(MATCH(A342, Application.!A:A, 0)), \"\", MATCH(A342, Application.!A:A, 0))","v":377}]
[343,"  ","i ","   "," e",null,"OCF Open Connectivity Foundation",null,false,"No",null,null,null,null,null,"",{"$f":"IF(ISNA(MATCH(A343, Application.!A:A, 0)), \"\", MATCH(A343, Application.!A:A, 0))","v":378}]
[344,null,null,null,"e",null,"TALQ",null,false,"No",null,null,null,null,null,"",{"$f":"IF(ISNA(MATCH(A344, Application.!A:A, 0)), \"\", MATCH(A344, Application.!A:A, 0))","v":379}]
[345,"  ","i ","   "," e",null,"XML",null,false,"No",null,null,null,null,null,285,{"$f":"IF(ISNA(MATCH(A345, Application.!A:A, 0)), \"\", MATCH(A345, Application.!A:A, 0))","v":380}]
[346,"  ","i ","   "," e",null,"Custom per user request",null,false,"No",null,null,null,null,null,286,{"$f":"IF(ISNA(MATCH(A346, Application.!A:A, 0)), \"\", MATCH(A346, Application.!A:A, 0))","v":381}]
[347,"  ","i ","   "," e",null,"Other (explain)",null,null,{"$f":"H347","v":0},null,null,null,null,null,287,{"$f":"IF(ISNA(MATCH(A347, Application.!A:A, 0)), \"\", MATCH(A347, Application.!A:A, 0))","v":383}]
[348,"   \n ","i  \n ","    \n "," e \n ","Does your customer contract offer a clause making energy data available to support energy efficiency rebates and incentives?",null,null,false,"No",null,null,null,null,null,350,{"$f":"IF(ISNA(MATCH(A348, Application.!A:A, 0)), \"\", MATCH(A348, Application.!A:A, 0))","v":384}]
[349,"   \n ","i  \n ","    \n "," e \n ","Does your customer contract offer a clause making anonymized energy data available for research on energy savings?",null,null,false,"No",null,null,null,null,null,351,{"$f":"IF(ISNA(MATCH(A349, Application.!A:A, 0)), \"\", MATCH(A349, Application.!A:A, 0))","v":385}]
[350,"  ","i ","   "," e","11)","Energy Monitoring",null,null,null,null,null,null,null,null,352,{"$f":"IF(ISNA(MATCH(A350, Application.!A:A, 0)), \"\", MATCH(A350, Application.!A:A, 0))","v":386}]
[351,"  ","i ","   "," e","12)","Device Monitoring / Remote Diagnostics",null,null,null,null,null,null,null,null,353,{"$f":"IF(ISNA(MATCH(A351, Application.!A:A, 0)), \"\", MATCH(A351, Application.!A:A, 0))","v":387}]
[352," \n \n \n"," \n \n \n"," \n \n \n"," \n \n \n","Definition:  The capability to monitor, diagnose, and report operational performance including system and/or component failures.  ",null,"\n",true,{"$f":"IF(I352=TRUE,\"Yes\", \"No\")","v":"Yes"},"The system can communicate energy usage and occupancy status.  See spec submittal: http://www.lutron.com/TechnicalDocumentLibrary/369902_ENG.pdf",null,"y","02p2: \"Dashboard of current status for control and monitoring of the system.\"","at component level, occ sensor or pico, can say it has low battery with flashing light","",{"$f":"IF(ISNA(MATCH(A352, Application.!A:A, 0)), \"\", MATCH(A352, Application.!A:A, 0))","v":388}]
[353,"  \n ","i \n ","   \n "," e\n ","Does the system have Device Monitoring/Remote Diagnostics capability?",null,null,true,"Yes","15-Wireless Occ Sensor Install Guide, Troublshooting #9",null,"y",null,null,355,{"$f":"IF(ISNA(MATCH(A353, Application.!A:A, 0)), \"\", MATCH(A353, Application.!A:A, 0))","v":389}]
[354,"  \n ","i \n ","   \n "," e\n ","What system characteristics can be monitored, diagnosed, and/or reported? ",null,"Select all that apply",null,null,null,null,null,null,null,356,{"$f":"IF(ISNA(MATCH(A354, Application.!A:A, 0)), \"\", MATCH(A354, Application.!A:A, 0))","v":390}]
[355,"  ","i ","   "," e",null,"Battery Level or Remaining Battery Life of wireless switches/sensors",null,false,"No",null,null,null,null,null,357,{"$f":"IF(ISNA(MATCH(A355, Application.!A:A, 0)), \"\", MATCH(A355, Application.!A:A, 0))","v":""}]
[356,"  ","i ","   "," e",null,"Communication Issues or faults",null,false,"No",null,null,null,null,null,358,{"$f":"IF(ISNA(MATCH(A356, Application.!A:A, 0)), \"\", MATCH(A356, Application.!A:A, 0))","v":391}]
[357,"  ","i ","   "," e",null,"Network Latency",null,false,"No",null,null,null,null,null,359,{"$f":"IF(ISNA(MATCH(A357, Application.!A:A, 0)), \"\", MATCH(A357, Application.!A:A, 0))","v":392}]
[358,"  ","i ","   "," e",null,"Network Signal Strength",null,false,"No",null,null,null,null,null,360,{"$f":"IF(ISNA(MATCH(A358, Application.!A:A, 0)), \"\", MATCH(A358, Application.!A:A, 0))","v":""}]
[359,"  ","i ","   "," e",null,"Status: online/offline devices",null,false,"No",null,null,null,null,null,361,{"$f":"IF(ISNA(MATCH(A359, Application.!A:A, 0)), \"\", MATCH(A359, Application.!A:A, 0))","v":""}]
[360,"  ","i ","   "," e",null,"Device errors",null,false,"No",null,null,null,null,null,362,{"$f":"IF(ISNA(MATCH(A360, Application.!A:A, 0)), \"\", MATCH(A360, Application.!A:A, 0))","v":395}]
[361,"  ","i ","   "," e",null,"Component failures: lamp, ballast, driver, light bar, etc.",null,false,"No",null,null,null,null,null,363,{"$f":"IF(ISNA(MATCH(A361, Application.!A:A, 0)), \"\", MATCH(A361, Application.!A:A, 0))","v":396}]
[362,"  ","i ","   "," e",null,"Remaining life: Lamp, Ballast, Driver, light far, etc.",null,false,"No",null,null,null,null,null,364,{"$f":"IF(ISNA(MATCH(A362, Application.!A:A, 0)), \"\", MATCH(A362, Application.!A:A, 0))","v":397}]
[363,"  ","i ","   "," e",null,"Other","low battery, lost communication",null,{"$f":"H363","v":"low battery, lost communication"},"15-Wireless Occ Sensor Install Guide, Troublshooting #9",null,"y",null,null,365,{"$f":"IF(ISNA(MATCH(A363, Application.!A:A, 0)), \"\", MATCH(A363, Application.!A:A, 0))","v":398}]
[364,null,"i ",null," e","What mechanisms are provided to alert system problems or failures?  ",null,"Select all that apply",null,null,null,null,null,null,null,366,{"$f":"IF(ISNA(MATCH(A364, Application.!A:A, 0)), \"\", MATCH(A364, Application.!A:A, 0))","v":399}]
[365,"  ","i ","   "," e",null,"Blinking LED luminaire",null,false,"No",null,null,null,null,null,367,{"$f":"IF(ISNA(MATCH(A365, Application.!A:A, 0)), \"\", MATCH(A365, Application.!A:A, 0))","v":400}]
[366,"  ","i ","   "," e",null,"Blinking local LED status lights",null,true,"Yes","15-Wireless Occ Sensor Install Guide, Troublshooting #9",null,"y",null,null,368,{"$f":"IF(ISNA(MATCH(A366, Application.!A:A, 0)), \"\", MATCH(A366, Application.!A:A, 0))","v":401}]
[367,"  ","i ","   "," e",null,"Email notifications",null,false,"No",null,null,null,null,null,369,{"$f":"IF(ISNA(MATCH(A367, Application.!A:A, 0)), \"\", MATCH(A367, Application.!A:A, 0))","v":402}]
[368,"  ","i ","   "," e",null,"GUI alerts",null,false,"No",null,null,null,null,null,370,{"$f":"IF(ISNA(MATCH(A368, Application.!A:A, 0)), \"\", MATCH(A368, Application.!A:A, 0))","v":403}]
[369,"  ","i ","   "," e",null,"GUI map of offline devices",null,false,"No",null,null,null,null,null,371,{"$f":"IF(ISNA(MATCH(A369, Application.!A:A, 0)), \"\", MATCH(A369, Application.!A:A, 0))","v":404}]
[370,"  ","i ","   "," e",null,"GUI diagnostic page",null,false,"No",null,null,null,null,null,372,{"$f":"IF(ISNA(MATCH(A370, Application.!A:A, 0)), \"\", MATCH(A370, Application.!A:A, 0))","v":405}]
[371,"  ","i ","   "," e",null,"Outage reports",null,false,"No",null,null,null,null,null,373,{"$f":"IF(ISNA(MATCH(A371, Application.!A:A, 0)), \"\", MATCH(A371, Application.!A:A, 0))","v":406}]
[372,"  ","i ","   "," e",null,"Other",null,null,{"$f":"H372","v":0},null,null,null,null,null,374,{"$f":"IF(ISNA(MATCH(A372, Application.!A:A, 0)), \"\", MATCH(A372, Application.!A:A, 0))","v":407}]
[373,"  ","i ","   "," e","12)","Device Monitoring / Remote Diagnostics",null,null,null,null,null,null,null,null,375,{"$f":"IF(ISNA(MATCH(A373, Application.!A:A, 0)), \"\", MATCH(A373, Application.!A:A, 0))","v":408}]
[374,"  ","i ","   "," e","13)","User Interface",null,null,null,null,null,null,null,null,376,{"$f":"IF(ISNA(MATCH(A374, Application.!A:A, 0)), \"\", MATCH(A374, Application.!A:A, 0))","v":409}]
[375," \n \n \n"," \n \n \n"," \n \n \n"," \n \n \n","Definition:  The type of interface used by the control system for reading and adjusting control system settings during system start-up, commissioning, and/or ongoing operation.",null,null,null,null,null,null,null,null,null,377,{"$f":"IF(ISNA(MATCH(A375, Application.!A:A, 0)), \"\", MATCH(A375, Application.!A:A, 0))","v":410}]
[376,"  ","i ","   "," e","What is the User Interface platform(s)?",null,"Select all that apply",null,null,null,null,null,null,null,378,{"$f":"IF(ISNA(MATCH(A376, Application.!A:A, 0)), \"\", MATCH(A376, Application.!A:A, 0))","v":411}]
[377,"  ","i ","   "," e",null,"App for Android",null,false,{"$f":"IF(I377=TRUE,\"Yes\", \"No\")","v":"No"},"doc coming 8/18.  'no' until proven otherwise",null,"q","01p40 2a.?, 02p2?","not released.  Coming 8/18.  Will update QPL with 377 and 378 yes, after receiving confirmation that new App is released.",379,{"$f":"IF(ISNA(MATCH(A377, Application.!A:A, 0)), \"\", MATCH(A377, Application.!A:A, 0))","v":412}]
[378,"  ","i ","   "," e",null,"App for IOS",null,false,"No","doc coming 8/18.  'no' until proven otherwise",null,"q","05p1, 2, 3,7, 13, 14? 01p40 2b.?, 02p2?","not released.  Coming 8/18.  Will update QPL with 377 and 378 yes, after receiving confirmation that new App is released.",380,{"$f":"IF(ISNA(MATCH(A378, Application.!A:A, 0)), \"\", MATCH(A378, Application.!A:A, 0))","v":413}]
[379,"  ","i ","   "," e",null,"Local indicator lights",null,false,"No",null,null,null,null,null,381,{"$f":"IF(ISNA(MATCH(A379, Application.!A:A, 0)), \"\", MATCH(A379, Application.!A:A, 0))","v":414}]
[380,"  ","i ","   "," e",null,"Local pushbuttons or switches",null,true,"Yes","05-Brochure, Pages 34 & 35",null,"y",null,null,382,{"$f":"IF(ISNA(MATCH(A380, Application.!A:A, 0)), \"\", MATCH(A380, Application.!A:A, 0))","v":415}]
[381,"  ","i ","   "," e",null,"Remote control w/o display",null,true,"Yes","05-Brochure, Pages 36 thru 39",null,"y",null,null,385,{"$f":"IF(ISNA(MATCH(A381, Application.!A:A, 0)), \"\", MATCH(A381, Application.!A:A, 0))","v":416}]
[382,"  ","i ","   "," e",null,"Remote control with display",null,false,"No",null,null,null,null,null,386,{"$f":"IF(ISNA(MATCH(A382, Application.!A:A, 0)), \"\", MATCH(A382, Application.!A:A, 0))","v":417}]
[383,"  ","i ","   "," e",null,"USB dongle for web browser or software",null,false,"No",null,null,null,null,null,387,{"$f":"IF(ISNA(MATCH(A383, Application.!A:A, 0)), \"\", MATCH(A383, Application.!A:A, 0))","v":418}]
[384,"  ","i ","   "," e",null,"Wall mounted control",null,true,"Yes","05-Brochure, Pages 34 thru 39",null,"y",null,null,389,{"$f":"IF(ISNA(MATCH(A384, Application.!A:A, 0)), \"\", MATCH(A384, Application.!A:A, 0))","v":419}]
[385,"  ","i ","   "," e",null,"Web browser (Windows & IOS)",null,true,"Yes","02-Hub Spec Submittal, Page 2, Features #1",null,"y","02p2",null,390,{"$f":"IF(ISNA(MATCH(A385, Application.!A:A, 0)), \"\", MATCH(A385, Application.!A:A, 0))","v":420}]
[386,"  ","i ","   "," e",null,"Windows-based software program",null,false,"No",null,null,null,null,null,391,{"$f":"IF(ISNA(MATCH(A386, Application.!A:A, 0)), \"\", MATCH(A386, Application.!A:A, 0))","v":421}]
[387,"  ","i ","   "," e","Does the system have the capability to upload a floorplan?",null,"Yes",false,"No",null,null,null,null,null,393,{"$f":"IF(ISNA(MATCH(A387, Application.!A:A, 0)), \"\", MATCH(A387, Application.!A:A, 0))","v":422}]
[388,"   \n ","i  \n ","    \n "," e \n ","Does the system have the capability to modify settings that are displayed on a floorplan?",null,"Yes",false,"No",null,null,null,null,null,396,{"$f":"IF(ISNA(MATCH(A388, Application.!A:A, 0)), \"\", MATCH(A388, Application.!A:A, 0))","v":423}]
[389,"   \n ","i  \n ","    \n "," e \n ","Does the User Interface utilize two-way communication? (i.e. can it both read settings from the device and adjust settings?)",null,"Yes",true,"Yes","02-Hub Spec Submittal",null,"y","02p9, 10 - Ports Used: Outbound and Inbound",null,397,{"$f":"IF(ISNA(MATCH(A389, Application.!A:A, 0)), \"\", MATCH(A389, Application.!A:A, 0))","v":424}]
[390,"  ","i ","   "," e","Can the User Interface display existing system settings?",null,"Yes",true,"Yes","01-p33",null,"y",null,"02p2: \"Dashboard of current status for control and monitoring of the system. Also shows current energy usage.\"  Is a GUI document available that covers what can be displayed?  Screen Shots?",398,{"$f":"IF(ISNA(MATCH(A390, Application.!A:A, 0)), \"\", MATCH(A390, Application.!A:A, 0))","v":425}]
[391,"  ","i ","   "," e","Notes, if needed",null,null,null,{"$f":"H391","v":0},null,null,null,null,null,399,{"$f":"IF(ISNA(MATCH(A391, Application.!A:A, 0)), \"\", MATCH(A391, Application.!A:A, 0))","v":426}]
[392,"  ","i ","   "," e","13)","User Interface",null,null,null,null,null,null,null,null,400,{"$f":"IF(ISNA(MATCH(A392, Application.!A:A, 0)), \"\", MATCH(A392, Application.!A:A, 0))","v":427}]
[393,"  ","i ","   ",null,"14)","Luminaire Level Lighting Control, Integrated",null,null,null,null,null,null,null,null,401,{"$f":"IF(ISNA(MATCH(A393, Application.!A:A, 0)), \"\", MATCH(A393, Application.!A:A, 0))","v":428}]
[394," \n  \n \n \n\n \n"," \n  \n \n \n\n \n"," \n  \n \n \n\n \n"," \n  \n \n \n\n\n\n \n \n \n \n \n \n","Definition:  The capability to have a networked occupancy sensor and ambient light sensor installed for each luminaire, and directly integrated or embedded into the luminaire form factor during the luminaire manufacturing process.  \n\nIn addition to these required integrated components, LLC systems must have Control Persistence capability as described in this document.  \n\nTo demonstrate commercial availability of the integrated component options, at least one family, luminaire or kit with integrated control must be verified by DLC.  Manufacturers may choose whether or not to list this information publicly on the QPL.  \n",null,null,null,null,null,null,null,null,null,402,{"$f":"IF(ISNA(MATCH(A394, Application.!A:A, 0)), \"\", MATCH(A394, Application.!A:A, 0))","v":429}]
[395,"  \n \n \n","i \n \n \n","   \n \n \n",null,"Does the system have the capability to integrate/embed an occupancy sensor and ambient light sensor directly into a luminaire at the time of manufacture; and also satisfy the Control Persistence capability?",null,null,true,{"$f":"IF(I395=TRUE,\"Yes\", \"No\")","v":"Yes"},"16-Integral Fixture Control Spec Submittal, Page 1",null,"y",null,null,403,{"$f":"IF(ISNA(MATCH(A395, Application.!A:A, 0)), \"\", MATCH(A395, Application.!A:A, 0))","v":430}]
[396,"  \n\n \n","i \n\n \n \n","   \n\n \n",null,null,"What manufacturer(s) and what luminaires are available with the sensors and network interface embedded?  Please provide list of all manufacturers and families/sub-brands/styles available. Please note if you would like this information to not be listed publicly on the QPL. ","  \nhttp://www.lutron.com/en-us/pages/hpfl/hpfl.aspx",null,{"$f":"H396","v":"  \nhttp://www.lutron.com/en-us/pages/hpfl/hpfl.aspx"},"http://www.lutron.com/en-us/pages/hpfl/hpfl.aspx?wl=1, 17-Integrated Lighting Control List",null,"y","Link to on-line list. Currently 285 products listed - only 94 with integrated sensors","LSI, Xtralight, Hubbell, Columbia, Litecontrol, Prescolite.  Ref 17 is a snapshot export from that website.",404,{"$f":"IF(ISNA(MATCH(A396, Application.!A:A, 0)), \"\", MATCH(A396, Application.!A:A, 0))","v":431}]
[397,"  ","i ","   "," e","14)","Luminaire Level Lighting Control, Integrated",null,null,null,null,null,null,null,null,414,{"$f":"IF(ISNA(MATCH(A397, Application.!A:A, 0)), \"\", MATCH(A397, Application.!A:A, 0))","v":432}]
[398,"  ","i ","   ",null,"15)","Personal Control",null,null,null,null,null,null,null,null,415,{"$f":"IF(ISNA(MATCH(A398, Application.!A:A, 0)), \"\", MATCH(A398, Application.!A:A, 0))","v":433}]
[399,null,"i \n \n\n \n \n\n \n \n\n \n \n \n\n \n \n \n \n",null,null,"Definition:  The capability for individual users to adjust to their personal preferences, via networked means, the illuminated environment of a light fixture or group on of light fixtures in a specific task area.  The system must be clearly designed for this purpose with a control interface designed for a single individual user that does not provide access to system-wide settings. \nA wireless dimmer switch may only be considered a personal control interface if product documentation \n   (a) shows that the physical configuration is suitable for workstation use, and \n   (b) describes configuration for personal control within a larger area. \nA software-based interface may only be considered personal control if product documentation \n   (a) shows it provides a specific interface intended for personal control by an individual user within a subsection of a larger space and \n   b) that the interface only allows access to personal control functions for the light fixtures in the specific areas being controlled.    ",null,null,null,null,null,null,null,null,null,416,{"$f":"IF(ISNA(MATCH(A399, Application.!A:A, 0)), \"\", MATCH(A399, Application.!A:A, 0))","v":434}]
[400,"  ","i ","   ",null,"Does the system have personal control capability?",null,null,true,{"$f":"IF(I400=TRUE,\"Yes\", \"No\")","v":"Yes"},"18-Pico Wireless Control Spec Submittal",null,"y","discussed in presentation","Did not find specific language describing configuration for personal control within a larger area.  I believe that the system is capable of personal control via Pico Wireless Controllers at each workstation (01p23: \"you can assign a 2BRL Pico remote control to each PowPak device\"); however, specific language describing personal control configurations was not referenced or cited.",417,{"$f":"IF(ISNA(MATCH(A400, Application.!A:A, 0)), \"\", MATCH(A400, Application.!A:A, 0))","v":435}]
[401,"  ","i ","   ",null,"What interface does the personal control use? ",null,"Select all that apply",null,null,null,null,null,null,null,418,{"$f":"IF(ISNA(MATCH(A401, Application.!A:A, 0)), \"\", MATCH(A401, Application.!A:A, 0))","v":436}]
[402,"  ","i ","   ",null,null,"App for Android",null,false,"No",null,null,null,null,null,419,{"$f":"IF(ISNA(MATCH(A402, Application.!A:A, 0)), \"\", MATCH(A402, Application.!A:A, 0))","v":437}]
[403,"  ","i ","   ",null,null,"App for IOS",null,false,"No",null,null,null,null,null,420,{"$f":"IF(ISNA(MATCH(A403, Application.!A:A, 0)), \"\", MATCH(A403, Application.!A:A, 0))","v":438}]
[404,"  ","i ","   ",null,null,"Local wireless dimmer switch",null,true,"Yes","11-Maestro Wireless Spec Submittal",null,"y","See O400",null,421,{"$f":"IF(ISNA(MATCH(A404, Application.!A:A, 0)), \"\", MATCH(A404, Application.!A:A, 0))","v":439}]
[405,"  ","i ","   ",null,null,"Remote control w/o display",null,true,"Yes","18-Pico Wireless Control Spec Submittal",null,"y","See O400",null,422,{"$f":"IF(ISNA(MATCH(A405, Application.!A:A, 0)), \"\", MATCH(A405, Application.!A:A, 0))","v":440}]
[406,"  ","i ","   ",null,null,"Remote control with display",null,false,"No",null,null,null,null,null,423,{"$f":"IF(ISNA(MATCH(A406, Application.!A:A, 0)), \"\", MATCH(A406, Application.!A:A, 0))","v":441}]
[407,"  ","i ","   ",null,null,"Web browser (Windows & IOS)",null,true,"Yes","01-Programming Guide, Page 33",null,"y","See O400","Does the App offer different user permissions and configurations?  Can the App be configured so that each user only has control of the luminaire directly above a specific workstation?  How would this be configured and commissioned? ",424,{"$f":"IF(ISNA(MATCH(A407, Application.!A:A, 0)), \"\", MATCH(A407, Application.!A:A, 0))","v":442}]
[408,"  ","i ","   ",null,null,"Windows-based software program",null,false,"No",null,null,null,null,null,425,{"$f":"IF(ISNA(MATCH(A408, Application.!A:A, 0)), \"\", MATCH(A408, Application.!A:A, 0))","v":443}]
[409,"  ","i ","   ",null,"Can luminaires be zoned/grouped for personal control?",null,"Yes",true,"Yes","05-Brochure",null,"y","See O400",null,427,{"$f":"IF(ISNA(MATCH(A409, Application.!A:A, 0)), \"\", MATCH(A409, Application.!A:A, 0))","v":444}]
[410,"  \n \n","i \n \n","   \n \n",null,"Does the system automatically learn/adapt to a user's personal control preferences?",null,null,false,"No",null,null,null,null,null,428,{"$f":"IF(ISNA(MATCH(A410, Application.!A:A, 0)), \"\", MATCH(A410, Application.!A:A, 0))","v":445}]
[411,"  ","i ","   ",null,null," If so, what are the results?",null,null,{"$f":"H411","v":0},null,null,null,null,null,429,{"$f":"IF(ISNA(MATCH(A411, Application.!A:A, 0)), \"\", MATCH(A411, Application.!A:A, 0))","v":446}]
[412,"  ","i ","   ",null,"Can the system report out personal control  settings? ",null,null,true,"Yes","14-BACnet PICS",null,"y","please provide document and citation where the functionality in question is specifically referenced and claim can be verified","can see lighting level by bacnet",430,{"$f":"IF(ISNA(MATCH(A412, Application.!A:A, 0)), \"\", MATCH(A412, Application.!A:A, 0))","v":447}]
[413,"  ","i ","   ",null,null,"If so, how?","via BACnet",null,{"$f":"H413","v":"via BACnet"},"14-BACnet PICS",null,"y","please provide document and citation where the functionality in question is specifically referenced and claim can be verified","See O412",431,{"$f":"IF(ISNA(MATCH(A413, Application.!A:A, 0)), \"\", MATCH(A413, Application.!A:A, 0))","v":448}]
[414,"  ","i ","   ",null,"15)","Personal Control",null,null,null,null,null,null,null,null,432,{"$f":"IF(ISNA(MATCH(A414, Application.!A:A, 0)), \"\", MATCH(A414, Application.!A:A, 0))","v":449}]
[415,"  ","i ","   "," e","16)","Load Shedding (Demand Response)",null,null,null,null,null,null,null,null,433,{"$f":"IF(ISNA(MATCH(A415, Application.!A:A, 0)), \"\", MATCH(A415, Application.!A:A, 0))","v":450}]
[416,"\n \n \n \n \n","\n \n \n \n \n","\n \n \n \n \n","\n \n \n \n \n","Definition:  The ability to reduce the energy consumption of a lighting system, in a pre-defined way, on a temporary basis, in response to a demand response signal. The method by which the system implements this capability must be clearly described in the Reference document(s).  ",null,null,null,null,null,null,null,null,null,434,{"$f":"IF(ISNA(MATCH(A416, Application.!A:A, 0)), \"\", MATCH(A416, Application.!A:A, 0))","v":451}]
[417,"  ","i "," "," e","Does the system have load-shedding/demand response capability?",null,null,true,{"$f":"IF(I417=TRUE,\"Yes\", \"No\")","v":"Yes"},"02-Hub Spec Submittal",null,"y","02p1: \"Contact Closure Inputs for integration with devices by others including devices for Title 24 Automatic Demand Response.\"  02p3: \"Load shed is configurable.\" 01p28 ",null,435,{"$f":"IF(ISNA(MATCH(A417, Application.!A:A, 0)), \"\", MATCH(A417, Application.!A:A, 0))","v":452}]
[418,"  \n ","i \n ","   \n "," e\n ","Does the system have the ability to implement demand response via an external signal? ",null,null,true,"Yes","02-Hub Spec Submittal",null,"y","01p28: \"Load shed is a feature that reduces the overall lighting load in a system in response to an external signal (typically from a utility company).\"  …\"automatically activated through the contact closure input on the back of the hub, or automatically activated via BACnet.\"",null,436,{"$f":"IF(ISNA(MATCH(A418, Application.!A:A, 0)), \"\", MATCH(A418, Application.!A:A, 0))","v":453}]
[419,"  ","i ","   "," e","If yes, how?",null,"Select all that apply",null,null,null,null,null,null,null,437,{"$f":"IF(ISNA(MATCH(A419, Application.!A:A, 0)), \"\", MATCH(A419, Application.!A:A, 0))","v":454}]
[420,"  ","i ","   "," e",null,"BACnet",null,true,"Yes","02-Hub Spec Submittal",null,"y","01p28",null,438,{"$f":"IF(ISNA(MATCH(A420, Application.!A:A, 0)), \"\", MATCH(A420, Application.!A:A, 0))","v":455}]
[421,"  ","i ","   "," e",null,"Dry contact",null,true,"Yes","02-Hub Spec Submittal",null,"y","01p28",null,439,{"$f":"IF(ISNA(MATCH(A421, Application.!A:A, 0)), \"\", MATCH(A421, Application.!A:A, 0))","v":456}]
[422,"  ","i ","   "," e",null,"OpenADR via internet",null,false,"No",null,null,null,null,null,440,{"$f":"IF(ISNA(MATCH(A422, Application.!A:A, 0)), \"\", MATCH(A422, Application.!A:A, 0))","v":457}]
[423,"  ","i ","   "," e",null,"Programmed digital switch",null,false,"No",null,null,null,null,null,441,{"$f":"IF(ISNA(MATCH(A423, Application.!A:A, 0)), \"\", MATCH(A423, Application.!A:A, 0))","v":458}]
[424,"  ","i ","   "," e",null,"Third Party hardware and software",null,false,"No",null,null,null,null,null,442,{"$f":"IF(ISNA(MATCH(A424, Application.!A:A, 0)), \"\", MATCH(A424, Application.!A:A, 0))","v":459}]
[425,"  ","i ","   "," e",null,"Other",null,null,{"$f":"H425","v":0},null,null,null,"please provide document and citation where the functionality in question is specifically referenced and claim can be verified",null,443,{"$f":"IF(ISNA(MATCH(A425, Application.!A:A, 0)), \"\", MATCH(A425, Application.!A:A, 0))","v":460}]
[426,null,"i ",null," e","Does the system have the ability to report real-time power reduction? ",null,null,false,"No","02-Hub Spec Submittal",null,null,"please provide document and citation where the functionality in question is specifically referenced and claim can be verified",null,444,{"$f":"IF(ISNA(MATCH(A426, Application.!A:A, 0)), \"\", MATCH(A426, Application.!A:A, 0))","v":461}]
[427,"  ","i ","   "," e",null,"If yes, how?",null,null,{"$f":"H427","v":0},null,null,null,null,null,445,{"$f":"IF(ISNA(MATCH(A427, Application.!A:A, 0)), \"\", MATCH(A427, Application.!A:A, 0))","v":462}]
[428,"  ","i ","   "," e","Does the system comply with the OpenADR Standard?",null,null,false,"No",null,null,null,null,null,446,{"$f":"IF(ISNA(MATCH(A428, Application.!A:A, 0)), \"\", MATCH(A428, Application.!A:A, 0))","v":463}]
[429,"  ","i ","   "," e",null,"If yes, what version of OpenADR?","Select all that apply",null,null,null,null,null,null,null,447,{"$f":"IF(ISNA(MATCH(A429, Application.!A:A, 0)), \"\", MATCH(A429, Application.!A:A, 0))","v":464}]
[430,"  ","i ","   "," e",null,"1.0",null,false,"No",null,null,null,null,null,448,{"$f":"IF(ISNA(MATCH(A430, Application.!A:A, 0)), \"\", MATCH(A430, Application.!A:A, 0))","v":465}]
[431,"  ","i ","   "," e",null,"2.0a",null,false,"No",null,null,null,null,null,449,{"$f":"IF(ISNA(MATCH(A431, Application.!A:A, 0)), \"\", MATCH(A431, Application.!A:A, 0))","v":466}]
[432,"  ","i ","   "," e",null,"2.0b",null,false,"No",null,null,null,null,null,450,{"$f":"IF(ISNA(MATCH(A432, Application.!A:A, 0)), \"\", MATCH(A432, Application.!A:A, 0))","v":467}]
[433,"\n","i  \n","\n"," e\n","Is the OpenADR device tested and verified for OpenADR compliance, and listed in the OpenADR certified products database?",null,null,false,"No",null,null,null,null,null,451,{"$f":"IF(ISNA(MATCH(A433, Application.!A:A, 0)), \"\", MATCH(A433, Application.!A:A, 0))","v":468}]
[434,"  \n","i \n","   \n"," e\n","Does the system follow the GMLC (Grid Modernization Lab Consortium) draft Recommended Practice?",null,null,false,"No",null,null,null,null,null,"",{"$f":"IF(ISNA(MATCH(A434, Application.!A:A, 0)), \"\", MATCH(A434, Application.!A:A, 0))","v":469}]
[435,"  ","i ","   "," e","16)","Load Shedding (Demand Response)",null,null,null,null,null,null,null,null,456,{"$f":"IF(ISNA(MATCH(A435, Application.!A:A, 0)), \"\", MATCH(A435, Application.!A:A, 0))","v":470}]
[436,"  ","i ","   "," e","17)","Plug Load Control",null,null,null,null,null,null,null,null,457,{"$f":"IF(ISNA(MATCH(A436, Application.!A:A, 0)), \"\", MATCH(A436, Application.!A:A, 0))","v":471}]
[437," \n \n \n \n"," \n \n \n \n"," \n \n \n \n"," \n \n \n \n","Definition:  The capability to control the power delivered to receptacles through scheduling or occupancy sensing. The method by which the system implements this capability must be clearly described in the Reference document(s).",null,null,null,null,null,null,null,null,null,458,{"$f":"IF(ISNA(MATCH(A437, Application.!A:A, 0)), \"\", MATCH(A437, Application.!A:A, 0))","v":472}]
[438,"  ","i ","   "," e","Is plug load control available?",null,null,true,{"$f":"IF(I438=TRUE,\"Yes\", \"No\")","v":"Yes"},"05-Brochure, Pages 28 thru 31",null,"y",null,null,459,{"$f":"IF(ISNA(MATCH(A438, Application.!A:A, 0)), \"\", MATCH(A438, Application.!A:A, 0))","v":473}]
[439,null,null,null,null,"What method is used?",null,"Select all that apply",null,null,null,null,null,null,null,460,{"$f":"IF(ISNA(MATCH(A439, Application.!A:A, 0)), \"\", MATCH(A439, Application.!A:A, 0))","v":474}]
[440,null,null,null,null,null,"Smart outlet with integrated control",null,true,"Yes","20-Wireless Receptacle Spec Submittal",null,"y",null,null,461,{"$f":"IF(ISNA(MATCH(A440, Application.!A:A, 0)), \"\", MATCH(A440, Application.!A:A, 0))","v":475}]
[441,null,null,null,null,null,"Circuit level relay switch",null,true,"Yes","19-PowPak Receptacle Control Spec Submittal",null,"y",null,null,462,{"$f":"IF(ISNA(MATCH(A441, Application.!A:A, 0)), \"\", MATCH(A441, Application.!A:A, 0))","v":476}]
[442,null,null,null,null,null,"Other (explain)",null,null,{"$f":"H442","v":0},null,null,null,null,null,463,{"$f":"IF(ISNA(MATCH(A442, Application.!A:A, 0)), \"\", MATCH(A442, Application.!A:A, 0))","v":477}]
[443,"  ","i ","   "," e","What are the available control strategies? ",null,"Select all that apply",null,null,null,null,null,null,null,464,{"$f":"IF(ISNA(MATCH(A443, Application.!A:A, 0)), \"\", MATCH(A443, Application.!A:A, 0))","v":478}]
[444,"  ","i ","   "," e",null,"BACnet signal",null,true,"Yes","05-Brochure, Pages 14 & 15",null,"y",null,null,465,{"$f":"IF(ISNA(MATCH(A444, Application.!A:A, 0)), \"\", MATCH(A444, Application.!A:A, 0))","v":479}]
[445,"  ","i ","   "," e",null,"Demand response",null,true,"Yes","02-Hub Spec Submittal",null,"y","01p28-29",null,466,{"$f":"IF(ISNA(MATCH(A445, Application.!A:A, 0)), \"\", MATCH(A445, Application.!A:A, 0))","v":480}]
[446,"  ","i ","   "," e",null,"Manual control",null,true,"Yes","19-PowPak Receptacle Control Spec Submittal",null,"y","19p1",null,467,{"$f":"IF(ISNA(MATCH(A446, Application.!A:A, 0)), \"\", MATCH(A446, Application.!A:A, 0))","v":481}]
[447,"  ","i ","   "," e",null,"Occupancy",null,true,"Yes","19-PowPak Receptacle Control Spec Submittal",null,"y","19p1",null,468,{"$f":"IF(ISNA(MATCH(A447, Application.!A:A, 0)), \"\", MATCH(A447, Application.!A:A, 0))","v":482}]
[448,"  ","i ","   "," e",null,"Personal control",null,true,"Yes","19-PowPak Receptacle Control Spec Submittal",null,"y","19p1",null,469,{"$f":"IF(ISNA(MATCH(A448, Application.!A:A, 0)), \"\", MATCH(A448, Application.!A:A, 0))","v":483}]
[449,"  ","i ","   "," e",null,"Scheduling",null,true,"Yes","01-Programming Guide, Pages 25 & 26 (Schedules);  20 control the wireless receptacle with hub.  ",null,"y",null,"also PowPak receptacle controller p.11",470,{"$f":"IF(ISNA(MATCH(A449, Application.!A:A, 0)), \"\", MATCH(A449, Application.!A:A, 0))","v":484}]
[450,"  ","i ","   "," e",null,"Web/mobile interface",null,true,"Yes","01-Programming Guide, Pages 9 & 10 (Commissioning); 20 control the wireless receptacle with hub.  ",null,"y",null,null,471,{"$f":"IF(ISNA(MATCH(A450, Application.!A:A, 0)), \"\", MATCH(A450, Application.!A:A, 0))","v":485}]
[451,"  ","i ","   "," e",null,"Other (explain)",null,null,{"$f":"H451","v":0},null,null,null,null,null,472,{"$f":"IF(ISNA(MATCH(A451, Application.!A:A, 0)), \"\", MATCH(A451, Application.!A:A, 0))","v":486}]
[452,"   \n ","i  \n ","    \n "," e \n ","Does the system have the ability to monitor and report energy use of plug loads? ",null,null,true,{"$f":"IF(I452=TRUE,\"Yes\", \"No\")","v":"Yes"},"01-Programming Guide, p.11 and Page 33 (Control and Monitor)",null,"y",null,"01p.11: Note: The wattage for PowPak receptacle controllers cannot be\nentered since the wattage can change over time based on what is\nplugged into the receptacle.\nNote: The energy savings reported is instantaneous only. If historical\nenergy reporting is needed, a premium hub with BACnet should\nbe configured to work with a BMS. The BMS will store and report\nhistorical energy savings data.",473,{"$f":"IF(ISNA(MATCH(A452, Application.!A:A, 0)), \"\", MATCH(A452, Application.!A:A, 0))","v":487}]
[453,"  ","i ","   "," e","17)","Plug Load Control",null,null,null,null,null,null,null,null,474,{"$f":"IF(ISNA(MATCH(A453, Application.!A:A, 0)), \"\", MATCH(A453, Application.!A:A, 0))","v":488}]
[454,"  ","i ","   "," e","18)","External Systems Integration (e.g. BMS, EMS, HVAC, Lighting, API)",null,null,null,null,null,null,null,null,475,{"$f":"IF(ISNA(MATCH(A454, Application.!A:A, 0)), \"\", MATCH(A454, Application.!A:A, 0))","v":489}]
[455,"\n \n \n \n \n \n","\n \n \n \n \n \n","\n \n \n \n \n \n","\n \n \n \n \n \n","Definition:  The capability to exchange data with other networked systems such as Building or Energy Management Systems (BMS/EMS), Heating Ventilation and Air Conditioning (HVAC) Systems, or other Lighting and Building Systems via some form of communications link. The method, including formats and languages, by which the system implements this capability must be clearly described in the Reference document(s).",null,null,null,null,null,null,null,null,null,476,{"$f":"IF(ISNA(MATCH(A455, Application.!A:A, 0)), \"\", MATCH(A455, Application.!A:A, 0))","v":490}]
[456,"  \n \n","i \n \n","   \n \n"," e\n \n","Does the system have the ability to communicate with other building systems or networks?",null,null,true,{"$f":"IF(I456=TRUE,\"Yes\", \"No\")","v":"Yes"},"05-Brochure, Pages 14 &15",null,"y",null,null,477,{"$f":"IF(ISNA(MATCH(A456, Application.!A:A, 0)), \"\", MATCH(A456, Application.!A:A, 0))","v":491}]
[457,"  ","i ","   "," e","What other system(s) does the system communicate with? ",null,"Select all that apply",null,null,null,null,null,null,null,"",{"$f":"IF(ISNA(MATCH(A457, Application.!A:A, 0)), \"\", MATCH(A457, Application.!A:A, 0))","v":""}]
[458,"  ","i ","   "," e",null,"BMS (Building Management System)",null,true,"Yes","05-Brochure, Pages 14 &15",null,"y",null,null,"",{"$f":"IF(ISNA(MATCH(A458, Application.!A:A, 0)), \"\", MATCH(A458, Application.!A:A, 0))","v":492}]
[459,"  ","i ","   "," e",null,"EMS (Energy Management System)",null,true,"Yes","05-Brochure, Pages 14 &15",null,"y",null,null,"",{"$f":"IF(ISNA(MATCH(A459, Application.!A:A, 0)), \"\", MATCH(A459, Application.!A:A, 0))","v":493}]
[460,"  ","i ","   "," e",null,"HVAC (Heating Ventilation Air Conditioning)",null,true,"Yes","05-Brochure, Pages 14-15, 26-27",null,"y","05p26-27",null,"",{"$f":"IF(ISNA(MATCH(A460, Application.!A:A, 0)), \"\", MATCH(A460, Application.!A:A, 0))","v":494}]
[461,"  ","i ","   "," e",null,"Lighting",null,true,"Yes","05-Brochure, Pages 14 &15",null,"y",null,null,"",{"$f":"IF(ISNA(MATCH(A461, Application.!A:A, 0)), \"\", MATCH(A461, Application.!A:A, 0))","v":495}]
[462,"  ","i ","   "," e",null,"Other",null,null,{"$f":"H462","v":0},null,null,null,null,null,"",{"$f":"IF(ISNA(MATCH(A462, Application.!A:A, 0)), \"\", MATCH(A462, Application.!A:A, 0))","v":501}]
[463,"  ","i ","   "," e","What communication protocols are supported? ",null,"Select all that apply",null,null,null,null,null,null,null,478,{"$f":"IF(ISNA(MATCH(A463, Application.!A:A, 0)), \"\", MATCH(A463, Application.!A:A, 0))","v":502}]
[464,"  ","i ","   "," e",null,"BACNet® /IP  (ANSI SSPC 135)",null,true,{"$f":"IF(I464=TRUE,\"Yes\", \"No\")","v":"Yes"},"14-BACnet PICS, Page 1, Product Description",null,"y",null,null,479,{"$f":"IF(ISNA(MATCH(A464, Application.!A:A, 0)), \"\", MATCH(A464, Application.!A:A, 0))","v":503}]
[465,"  ","i ","   "," e",null,"BACNet® /MSTP",null,false,"No",null,null,null,null,null,"",{"$f":"IF(ISNA(MATCH(A465, Application.!A:A, 0)), \"\", MATCH(A465, Application.!A:A, 0))","v":504}]
[466,"  ","i ","   "," e",null,"Bluetooth Low Energy",null,false,"No",null,null,null,null,null,"",{"$f":"IF(ISNA(MATCH(A466, Application.!A:A, 0)), \"\", MATCH(A466, Application.!A:A, 0))","v":505}]
[467,"  ","i ","   "," e",null,"Contact closure",null,true,"Yes","10-PowPak CCO Module Spec Submittal",null,"y",null,null,480,{"$f":"IF(ISNA(MATCH(A467, Application.!A:A, 0)), \"\", MATCH(A467, Application.!A:A, 0))","v":506}]
[468,"  ","i ","   "," e",null,"Ethernet",null,true,{"$f":"IF(I468=TRUE,\"Yes\", \"No\")","v":"Yes"},"02-Hub Spec Submittal",null,"y",null,null,"",{"$f":"IF(ISNA(MATCH(A468, Application.!A:A, 0)), \"\", MATCH(A468, Application.!A:A, 0))","v":507}]
[469,"  ","i ","   "," e",null,"LonWorks®/ RS-232, RS-485",null,false,"No",null,null,null,null,null,481,{"$f":"IF(ISNA(MATCH(A469, Application.!A:A, 0)), \"\", MATCH(A469, Application.!A:A, 0))","v":508}]
[470,"  ","i ","   "," e",null,"Metasys®",null,false,"No",null,null,null,null,null,482,{"$f":"IF(ISNA(MATCH(A470, Application.!A:A, 0)), \"\", MATCH(A470, Application.!A:A, 0))","v":509}]
[471,"  ","i ","   "," e",null,"MODBUS® / RS-232, RS-485",null,false,"No",null,null,null,null,null,483,{"$f":"IF(ISNA(MATCH(A471, Application.!A:A, 0)), \"\", MATCH(A471, Application.!A:A, 0))","v":510}]
[472,"  ","i ","   "," e",null,"MODBUS® TCP/IP",null,false,"No",null,null,null,null,null,484,{"$f":"IF(ISNA(MATCH(A472, Application.!A:A, 0)), \"\", MATCH(A472, Application.!A:A, 0))","v":511}]
[473,"  ","i ","   "," e",null,"NiagaraAX / Ethernet ",null,false,"No",null,null,null,null,null,485,{"$f":"IF(ISNA(MATCH(A473, Application.!A:A, 0)), \"\", MATCH(A473, Application.!A:A, 0))","v":512}]
[474,"  ","i ","   "," e",null,"OpenADR / Ethernet",null,false,"No",null,null,null,null,null,"",{"$f":"IF(ISNA(MATCH(A474, Application.!A:A, 0)), \"\", MATCH(A474, Application.!A:A, 0))","v":513}]
[475,"  ","i ","   "," e",null,"Zigbee Light Link",null,false,"No",null,null,null,null,null,"",{"$f":"IF(ISNA(MATCH(A475, Application.!A:A, 0)), \"\", MATCH(A475, Application.!A:A, 0))","v":514}]
[476,"  ","i ","   "," e",null,"Other",null,null,{"$f":"H476","v":0},null,null,null,null,null,486,{"$f":"IF(ISNA(MATCH(A476, Application.!A:A, 0)), \"\", MATCH(A476, Application.!A:A, 0))","v":515}]
[477,"  ","i ","   "," e","What components are required? ",null,null,null,{"$f":"H477","v":0},null,null,null,null,null,487,{"$f":"IF(ISNA(MATCH(A477, Application.!A:A, 0)), \"\", MATCH(A477, Application.!A:A, 0))","v":516}]
[478,"  \n \n","i \n \n","   \n \n"," e\n \n","Are any components of the system certified for compliance with industry standards or specifications? ",null,null,false,{"$f":"IF(I478=TRUE,\"Yes\", \"No\")","v":"No"},null,null,null,null,null,488,{"$f":"IF(ISNA(MATCH(A478, Application.!A:A, 0)), \"\", MATCH(A478, Application.!A:A, 0))","v":517}]
[479,"  ","i ","   "," e",null," If yes, which components and which standards/specifications?",null,null,null,null,null,null,null,null,489,{"$f":"IF(ISNA(MATCH(A479, Application.!A:A, 0)), \"\", MATCH(A479, Application.!A:A, 0))","v":518}]
[480,null,"i"," "," e","What data can be communicated with HVAC systems? ",null,"Select all that apply",null,null,null,null,null,null,null,"",{"$f":"IF(ISNA(MATCH(A480, Application.!A:A, 0)), \"\", MATCH(A480, Application.!A:A, 0))","v":519}]
[481," ","i","   "," e",null,"Control strategy",null,false,{"$f":"IF(I481=TRUE,\"Yes\", \"No\")","v":"No"},null,null,null,null,null,"",{"$f":"IF(ISNA(MATCH(A481, Application.!A:A, 0)), \"\", MATCH(A481, Application.!A:A, 0))","v":520}]
[482," ","i","   "," e",null,"Energy usage",null,true,"Yes","14-BACnet PICS, Pages 4 & 5",null,"y",null,null,"",{"$f":"IF(ISNA(MATCH(A482, Application.!A:A, 0)), \"\", MATCH(A482, Application.!A:A, 0))","v":521}]
[483," ","i","   "," e",null,"Light level",null,true,"Yes","14-BACnet PICS, Pages 4 & 5",null,"y",null,null,502,{"$f":"IF(ISNA(MATCH(A483, Application.!A:A, 0)), \"\", MATCH(A483, Application.!A:A, 0))","v":522}]
[484," ","i","   "," e",null,"Light schedule ",null,false,"No",null,null,null,null,null,"",{"$f":"IF(ISNA(MATCH(A484, Application.!A:A, 0)), \"\", MATCH(A484, Application.!A:A, 0))","v":523}]
[485," ","i","   "," e",null,"Loadshed status",null,true,"Yes","14-BACnet PICS, Pages 4 & 5",null,"y",null,null,"",{"$f":"IF(ISNA(MATCH(A485, Application.!A:A, 0)), \"\", MATCH(A485, Application.!A:A, 0))","v":524}]
[486," ","i","   "," e",null,"Luminaire/power pack status",null,true,"Yes","14-BACnet PICS, Pages 4 & 5",null,"y",null,null,"",{"$f":"IF(ISNA(MATCH(A486, Application.!A:A, 0)), \"\", MATCH(A486, Application.!A:A, 0))","v":525}]
[487," ","i","   "," e",null,"Manual override status",null,false,"No",null,null,null,null,null,"",{"$f":"IF(ISNA(MATCH(A487, Application.!A:A, 0)), \"\", MATCH(A487, Application.!A:A, 0))","v":526}]
[488," ","i","   "," e",null,"Occupancy status",null,true,"Yes","14-BACnet PICS, Pages 4 & 5",null,"y",null,null,"",{"$f":"IF(ISNA(MATCH(A488, Application.!A:A, 0)), \"\", MATCH(A488, Application.!A:A, 0))","v":527}]
[489," ","i","   "," e",null,"Operation and fan modes",null,false,"No",null,null,null,null,null,"",{"$f":"IF(ISNA(MATCH(A489, Application.!A:A, 0)), \"\", MATCH(A489, Application.!A:A, 0))","v":528}]
[490," ","i","   "," e",null,"Remote sensor data",null,false,"No",null,null,null,null,null,"",{"$f":"IF(ISNA(MATCH(A490, Application.!A:A, 0)), \"\", MATCH(A490, Application.!A:A, 0))","v":529}]
[491," ","i","   "," e",null,"Temperature set point ",null,false,"No",null,null,null,null,null,"",{"$f":"IF(ISNA(MATCH(A491, Application.!A:A, 0)), \"\", MATCH(A491, Application.!A:A, 0))","v":530}]
[492," ","i","   "," e",null,"Thermostat status",null,false,"No",null,null,null,null,null,"",{"$f":"IF(ISNA(MATCH(A492, Application.!A:A, 0)), \"\", MATCH(A492, Application.!A:A, 0))","v":531}]
[493," ","i","   "," e",null,"User inputs",null,true,"Yes","14-BACnet PICS, Pages 4 & 5",null,"y",null,null,"",{"$f":"IF(ISNA(MATCH(A493, Application.!A:A, 0)), \"\", MATCH(A493, Application.!A:A, 0))","v":532}]
[494," ","i","   "," e",null,"Other (explain)",null,null,{"$f":"H494","v":0},null,null,null,null,null,"",{"$f":"IF(ISNA(MATCH(A494, Application.!A:A, 0)), \"\", MATCH(A494, Application.!A:A, 0))","v":533}]
[495,null,null,null,null,"Does the system provide an API?",null,null,false,"No",null,null,null,null,null,520,{"$f":"IF(ISNA(MATCH(A495, Application.!A:A, 0)), \"\", MATCH(A495, Application.!A:A, 0))","v":534}]
[496,"  ","i ","   "," e","Does the API accept input of operational commands?",null,null,false,"No",null,null,null,null,null,552,{"$f":"IF(ISNA(MATCH(A496, Application.!A:A, 0)), \"\", MATCH(A496, Application.!A:A, 0))","v":535}]
[497,"  ","i ","   "," e","Is API documentation available to customers?",null,null,false,"No",null,null,null,null,null,554,{"$f":"IF(ISNA(MATCH(A497, Application.!A:A, 0)), \"\", MATCH(A497, Application.!A:A, 0))","v":536}]
[498,"  \n \n","i \n \n","   \n \n"," e\n \n","Is an NDA (Non Disclosure Agreement) required, for customer access to API documentation?",null,null,false,"No",null,null,null,null,null,555,{"$f":"IF(ISNA(MATCH(A498, Application.!A:A, 0)), \"\", MATCH(A498, Application.!A:A, 0))","v":537}]
[499,"  ","i ","   "," e","Is the API available to third-party developers?",null,null,false,"No",null,null,null,null,null,556,{"$f":"IF(ISNA(MATCH(A499, Application.!A:A, 0)), \"\", MATCH(A499, Application.!A:A, 0))","v":538}]
[500,"  \n \n","i \n \n","   \n \n"," e\n \n","Is an NDA (Non Disclosure Agreement) required, for third-party developer access to the API?",null,null,false,"No",null,null,null,null,null,557,{"$f":"IF(ISNA(MATCH(A500, Application.!A:A, 0)), \"\", MATCH(A500, Application.!A:A, 0))","v":539}]
[501,"  ","i ","   "," e","Does the API comply with any industry standards?",null,"Select all that apply",null,null,null,null,null,null,null,558,{"$f":"IF(ISNA(MATCH(A501, Application.!A:A, 0)), \"\", MATCH(A501, Application.!A:A, 0))","v":540}]
[502,"  ","i ","   "," e",null,"C++ Standard Template Library",null,false,"No",null,null,null,null,null,"",{"$f":"IF(ISNA(MATCH(A502, Application.!A:A, 0)), \"\", MATCH(A502, Application.!A:A, 0))","v":541}]
[503,"  ","i ","   "," e",null,"IEEE POSIX",null,false,"No",null,null,null,null,null,"",{"$f":"IF(ISNA(MATCH(A503, Application.!A:A, 0)), \"\", MATCH(A503, Application.!A:A, 0))","v":542}]
[504,"  ","i ","   "," e",null,"IoTivity",null,false,"No",null,null,null,null,null,"",{"$f":"IF(ISNA(MATCH(A504, Application.!A:A, 0)), \"\", MATCH(A504, Application.!A:A, 0))","v":543}]
[505,"  ","i ","   "," e",null,"Java API",null,false,"No",null,null,null,null,null,559,{"$f":"IF(ISNA(MATCH(A505, Application.!A:A, 0)), \"\", MATCH(A505, Application.!A:A, 0))","v":544}]
[506,"  ","i ","   "," e",null,"Microsoft Windows API",null,false,"No",null,null,null,null,null,"",{"$f":"IF(ISNA(MATCH(A506, Application.!A:A, 0)), \"\", MATCH(A506, Application.!A:A, 0))","v":545}]
[507,"  ","i ","   "," e",null,"OpenAPI",null,false,"No",null,null,null,null,null,561,{"$f":"IF(ISNA(MATCH(A507, Application.!A:A, 0)), \"\", MATCH(A507, Application.!A:A, 0))","v":546}]
[508,null,null," ","e",null,"TALQ",null,false,"No",null,null,null,null,null,"",{"$f":"IF(ISNA(MATCH(A508, Application.!A:A, 0)), \"\", MATCH(A508, Application.!A:A, 0))","v":547}]
[509,"  ","i ","   "," e",null,"Other",null,null,{"$f":"H509","v":0},null,null,null,null,null,564,{"$f":"IF(ISNA(MATCH(A509, Application.!A:A, 0)), \"\", MATCH(A509, Application.!A:A, 0))","v":548}]
[510,"  ","i ","   "," e","18)","External Systems Integration (e.g. BMS, EMS, HVAC, Lighting, API)",null,null,null,null,null,null,null,null,565,{"$f":"IF(ISNA(MATCH(A510, Application.!A:A, 0)), \"\", MATCH(A510, Application.!A:A, 0))","v":549}]
[511,"  ","i ","   "," e","19) ","Emergency Lighting",null,null,null,null,null,null,null,null,566,{"$f":"IF(ISNA(MATCH(A511, Application.!A:A, 0)), \"\", MATCH(A511, Application.!A:A, 0))","v":550}]
[512," \n\n \n \n\n \n \n\n\n \n"," \n\n \n \n\n \n \n\n\n \n"," \n\n \n \n\n \n \n\n\n \n"," .\n \n \n \n \n \n \n \n \n \n \n\n \n \n \n ","The capability of a system’s luminaires to interact with one or more of the following emergency power sources: \n   1) on-luminaire battery backup, \n   2) remote source (generator or central battery), switched at luminaire, \n   3) remote source (generator or central battery), switched at central location. \n\nInformation provided on the QPL about this capability is not intended to fully characterize emergency lighting.  It is intended to provide information about the lighting control system as a point of reference for the emergency lighting design process. The QPL will identify online documentation provided by manufacturers for system designers to refer to.  This documentation will identify wiring diagrams, required components, and/or application guides needed to understand design considerations for integrating the system into an emergency lighting system. ",null,null,null,null,null,null,null,null,null,567,{"$f":"IF(ISNA(MATCH(A512, Application.!A:A, 0)), \"\", MATCH(A512, Application.!A:A, 0))","v":551}]
[513,"  ","i ","   "," e"," Does the system interact with one or more of the following emergency power sources: ",null,null,null,null,null,null,"Y",null,null,568,{"$f":"IF(ISNA(MATCH(A513, Application.!A:A, 0)), \"\", MATCH(A513, Application.!A:A, 0))","v":552}]
[514,"  ","i ","   "," e",null,"On-luminaire battery backup? URL with documentation:","http://www.lutron.com/TechnicalDocumentLibrary/ApNote106.pdf",null,{"$f":"H514","v":"http://www.lutron.com/TechnicalDocumentLibrary/ApNote106.pdf"},"23-Application Note #106, pages 34-43",null,"y","Application note #106 P 34-43",null,569,{"$f":"IF(ISNA(MATCH(A514, Application.!A:A, 0)), \"\", MATCH(A514, Application.!A:A, 0))","v":553}]
[515,null,"i ","   "," e",null,"Not Available",null,false,{"$f":"IF(I515=TRUE,\"NA\", \"No\")","v":"No"},null,null,null,null,null,"",{"$f":"IF(ISNA(MATCH(A515, Application.!A:A, 0)), \"\", MATCH(A515, Application.!A:A, 0))","v":554}]
[516,"  ","i ","   "," e\n ",null,"Remote source switched at luminaire? URL with documentation:","http://www.lutron.com/TechnicalDocumentLibrary/ApNote106.pdf",null,{"$f":"H516","v":"http://www.lutron.com/TechnicalDocumentLibrary/ApNote106.pdf"},"23-Application Note #106, pages 34-43",null,"y","Application note #106 P 34-43",null,570,{"$f":"IF(ISNA(MATCH(A516, Application.!A:A, 0)), \"\", MATCH(A516, Application.!A:A, 0))","v":555}]
[517,null,"i ","   "," e",null,"Not Available",null,false,{"$f":"IF(I517=TRUE,\"NA\", \"No\")","v":"No"},null,null,null,null,null,"",{"$f":"IF(ISNA(MATCH(A517, Application.!A:A, 0)), \"\", MATCH(A517, Application.!A:A, 0))","v":556}]
[518,"  ","\n i ","   "," e",null,"Remote source switched at central location? URL with documentation:","http://www.lutron.com/TechnicalDocumentLibrary/ApNote106.pdf",null,{"$f":"H518","v":"http://www.lutron.com/TechnicalDocumentLibrary/ApNote106.pdf"},"23-Application Note #106, pages 34-43",null,"y","Application note #106 P 34-43",null,571,{"$f":"IF(ISNA(MATCH(A518, Application.!A:A, 0)), \"\", MATCH(A518, Application.!A:A, 0))","v":557}]
[519,null,"i ","   "," e",null,"Not Available",null,false,{"$f":"IF(I519=TRUE,\"NA\", \"No\")","v":"No"},null,null,null,null,null,"",{"$f":"IF(ISNA(MATCH(A519, Application.!A:A, 0)), \"\", MATCH(A519, Application.!A:A, 0))","v":558}]
[520,"  ","\n i ","   "," e","Can the system perform Life-SafetyCompliance testing, and generate summary reports to support life-safety compliance?",null,null,false,{"$f":"IF(I520=TRUE,\"Yes\", \"No\")","v":"No"},null,null,null,null,null,572,{"$f":"IF(ISNA(MATCH(A520, Application.!A:A, 0)), \"\", MATCH(A520, Application.!A:A, 0))","v":559}]
[521,"  ","i ","   "," e","19) ","Emergency Lighting",null,null,null,null,null,null,null,null,573,{"$f":"IF(ISNA(MATCH(A521, Application.!A:A, 0)), \"\", MATCH(A521, Application.!A:A, 0))","v":560}]
[522,"  ","i ","   "," e","20)","Security",null,null,null,null,null,null,null,null,574,{"$f":"IF(ISNA(MATCH(A522, Application.!A:A, 0)), \"\", MATCH(A522, Application.!A:A, 0))","v":561}]
[523,"\n \n \n ","\n \n \n ","\n \n \n ","\n \n \n ","Definition:  DLC is providing an optional field on the QPL for system manufacturers to list a link to security information about their system. ",null,null,null,null,null,null,null,null,null,575,{"$f":"IF(ISNA(MATCH(A523, Application.!A:A, 0)), \"\", MATCH(A523, Application.!A:A, 0))","v":562}]
[524,null,null,null,null,"Would you like to share any information about security?",null,null,true,{"$f":"IF(I524=TRUE,\"Yes\", \"No\")","v":"Yes"},null,null,"y",null,null,581,{"$f":"IF(ISNA(MATCH(A524, Application.!A:A, 0)), \"\", MATCH(A524, Application.!A:A, 0))","v":563}]
[525,null,null,null,null,"If yes, URL to public website or document(s) on security:",null,"http://www.lutron.com/TechnicalDocumentLibrary/Vive_Security_Statement.pdf",null,{"$f":"H525","v":"http://www.lutron.com/TechnicalDocumentLibrary/Vive_Security_Statement.pdf"},null,null,"y",null,null,582,{"$f":"IF(ISNA(MATCH(A525, Application.!A:A, 0)), \"\", MATCH(A525, Application.!A:A, 0))","v":564}]
[526,"  ","i ","   "," e","20)","Security",null,null,null,null,null,null,null,null,583,{"$f":"IF(ISNA(MATCH(A526, Application.!A:A, 0)), \"\", MATCH(A526, Application.!A:A, 0))","v":565}]
[527,"  ","i ","   "," e","21)","Color Changing / Tuning",null,null,null,null,null,null,null,null,584,{"$f":"IF(ISNA(MATCH(A527, Application.!A:A, 0)), \"\", MATCH(A527, Application.!A:A, 0))","v":566}]
[528,"\n \n \n \n \n \n \n \n ","\n \n \n \n \n \n \n \n ","\n \n \n \n \n \n \n \n ","\n \n \n \n \n \n \n \n ","The capability to alter the output and color of tunable white and/or variable color output luminaires via a dedicated control interface(s). To demonstrate compliance with this capability, the interface(s) must be clearly described in the product literature and allow for at least two CCT settings.  These settings may be described in terms of CCT, such as 3000K or 5000K, or simple descriptive terms for the desired setting such as 'Night' or 'Day', for example. The product literature must also specify installation and configuration requirements to implement this functionality. ",null,null,null,null,null,null,null,null,null,585,{"$f":"IF(ISNA(MATCH(A528, Application.!A:A, 0)), \"\", MATCH(A528, Application.!A:A, 0))","v":567}]
[529,null,"i "," "," e","Does the system support Color Changing/Tuning as defined above?",null,null,false,{"$f":"IF(I529=TRUE,\"Yes\", \"No\")","v":"No"},null,null,null,null,null,586,{"$f":"IF(ISNA(MATCH(A529, Application.!A:A, 0)), \"\", MATCH(A529, Application.!A:A, 0))","v":568}]
[530,"  ","i ","   "," e","If yes, what control is offered?",null,"Select all that apply",null,null,null,null,null,null,null,587,{"$f":"IF(ISNA(MATCH(A530, Application.!A:A, 0)), \"\", MATCH(A530, Application.!A:A, 0))","v":569}]
[531,null,null,null,null,null,"Selection of multiple CCT settings",null,false,"No",null,null,null,null,null,588,{"$f":"IF(ISNA(MATCH(A531, Application.!A:A, 0)), \"\", MATCH(A531, Application.!A:A, 0))","v":570}]
[532,null,null,null,null,null,"Selection of multiple colors (Hues)",null,false,"No",null,null,null,null,null,589,{"$f":"IF(ISNA(MATCH(A532, Application.!A:A, 0)), \"\", MATCH(A532, Application.!A:A, 0))","v":571}]
[533,"  ","i ","   "," e",null,"Graphical indicator of CCT (Correlated Color Temperature)",null,false,"No",null,null,null,null,null,590,{"$f":"IF(ISNA(MATCH(A533, Application.!A:A, 0)), \"\", MATCH(A533, Application.!A:A, 0))","v":572}]
[534,"  ","i ","   "," e",null,"Graphical indicator of color (Hue)",null,false,"No",null,null,null,null,null,591,{"$f":"IF(ISNA(MATCH(A534, Application.!A:A, 0)), \"\", MATCH(A534, Application.!A:A, 0))","v":573}]
[535,null,null,null,null,null,"Other (explain)",null,null,{"$f":"H535","v":0},null,null,null,null,null,592,{"$f":"IF(ISNA(MATCH(A535, Application.!A:A, 0)), \"\", MATCH(A535, Application.!A:A, 0))","v":574}]
[536,"  ","i ","   "," e","21)","Color Changing / Tuning",null,null,null,null,null,null,null,null,593,{"$f":"IF(ISNA(MATCH(A536, Application.!A:A, 0)), \"\", MATCH(A536, Application.!A:A, 0))","v":575}]
[537,"  ","i ","   "," e","22)","Start-up and Configuration Party",null,null,null,null,null,null,null,null,594,{"$f":"IF(ISNA(MATCH(A537, Application.!A:A, 0)), \"\", MATCH(A537, Application.!A:A, 0))","v":576}]
[538,"\n \n \n \n ","\n \n \n \n ","\n \n \n \n ","\n \n \n \n ","Definition:  The QPL will identify the most typical responsible party and their required level of training to start-up and configure the system to the extent that all Required Capabilities are functioning.  Documentation is not required.",null,null,null,null,null,null,null,null,null,595,{"$f":"IF(ISNA(MATCH(A538, Application.!A:A, 0)), \"\", MATCH(A538, Application.!A:A, 0))","v":577}]
[539,"  ","i ","   "," e","Who primarily starts up and configures the system and how much training is typically required?  Select one most typical.",null,"Select one most typical.",null,null,null,null,null,null,null,596,{"$f":"IF(ISNA(MATCH(A539, Application.!A:A, 0)), \"\", MATCH(A539, Application.!A:A, 0))","v":578}]
[540,"  ","i ","   "," e",null,"(1) installation contractor with less than 1 day of training ",null,true,{"$f":"IF(I540=TRUE,\"Yes\", \"No\")","v":"Yes"},"05-Brochure, page 19",null,"y",null,null,597,{"$f":"IF(ISNA(MATCH(A540, Application.!A:A, 0)), \"\", MATCH(A540, Application.!A:A, 0))","v":579}]
[541,"  ","i ","   "," e",null,"(2) installation contractor with less than 1 day of training, working with remote personnel at factory",null,true,{"$f":"IF(I541=TRUE,\"Yes\", \"No\")","v":"Yes"},"05-Brochure, page 19",null,"y",null,null,598,{"$f":"IF(ISNA(MATCH(A541, Application.!A:A, 0)), \"\", MATCH(A541, Application.!A:A, 0))","v":580}]
[542,"  ","i ","   "," e",null,"(3) factory-trained installation contractor with 1 day or more factory training ",null,true,{"$f":"IF(I542=TRUE,\"Yes\", \"No\")","v":"Yes"},"05-Brochure, page 19",null,"y",null,null,599,{"$f":"IF(ISNA(MATCH(A542, Application.!A:A, 0)), \"\", MATCH(A542, Application.!A:A, 0))","v":581}]
[543,"  ","i ","   "," e",null,"(4) factory representative on-site ",null,true,{"$f":"IF(I543=TRUE,\"Yes\", \"No\")","v":"Yes"},"05-Brochure, page 19",null,"y",null,null,600,{"$f":"IF(ISNA(MATCH(A543, Application.!A:A, 0)), \"\", MATCH(A543, Application.!A:A, 0))","v":582}]
[544,"  ","i ","   "," e",null,"(5) other (describe)","Factory representative remote start-up",null,{"$f":"H544","v":"Factory representative remote start-up"},"05-Brochure, page 19",null,"y",null,null,601,{"$f":"IF(ISNA(MATCH(A544, Application.!A:A, 0)), \"\", MATCH(A544, Application.!A:A, 0))","v":583}]
[545,"  ","i ","   "," e","22)","Start-up and Configuration Party",null,null,null,null,null,null,null,null,602,{"$f":"IF(ISNA(MATCH(A545, Application.!A:A, 0)), \"\", MATCH(A545, Application.!A:A, 0))","v":584}]
[546,"I ","  ","E","   ","23)","Manufacturer and System ",null,null,null,null,null,null,null,null,617,{"$f":"IF(ISNA(MATCH(A546, Application.!A:A, 0)), \"\", MATCH(A546, Application.!A:A, 0))","v":585}]
[547,"  ","i ","   "," e","Company:",null,"Lutron Electronics Co Inc",null,{"$f":"H547","v":"Lutron Electronics Co Inc"},null,null,"y",null,null,618,{"$f":"IF(ISNA(MATCH(A547, Application.!A:A, 0)), \"\", MATCH(A547, Application.!A:A, 0))","v":586}]
[548,"  ","i ","   "," e","Brand:",null,"Vive Wireless Solutions",null,{"$f":"H548","v":"Vive Wireless Solutions"},null,null,"y",null,null,619,{"$f":"IF(ISNA(MATCH(A548, Application.!A:A, 0)), \"\", MATCH(A548, Application.!A:A, 0))","v":587}]
[549,"  ","i ","   "," e","Website:",null,"www.lutron.com/vive",null,"www.lutron.com/vive",null,null,"y",null,null,620,{"$f":"IF(ISNA(MATCH(A549, Application.!A:A, 0)), \"\", MATCH(A549, Application.!A:A, 0))","v":590}]
[550,"  ","i ","   "," e","Primary contact name:",null,"Jeremy Fye",null,{"$f":"H550","v":"Jeremy Fye"},null,null,"y",null,null,621,{"$f":"IF(ISNA(MATCH(A550, Application.!A:A, 0)), \"\", MATCH(A550, Application.!A:A, 0))","v":591}]
[551,"  ","i ","   "," e",null,"Phone:","(484) 387-7906",null,{"$f":"H551","v":"(484) 387-7906"},null,null,"y",null,null,622,{"$f":"IF(ISNA(MATCH(A551, Application.!A:A, 0)), \"\", MATCH(A551, Application.!A:A, 0))","v":592}]
[552,"  ","i ","   "," e",null,"Email:","jfye@lutron.com",null,"jfye@lutron.com",null,null,"y",null,null,623,{"$f":"IF(ISNA(MATCH(A552, Application.!A:A, 0)), \"\", MATCH(A552, Application.!A:A, 0))","v":593}]
[553,"  ","i ","   "," e","Optional second contact name for email cc:",null,"Craig Casey",null,"Craig Casey",null,null,"y",null,null,625,{"$f":"IF(ISNA(MATCH(A553, Application.!A:A, 0)), \"\", MATCH(A553, Application.!A:A, 0))","v":594}]
[554,"  ","i ","   "," e",null,"Phone:","(484) 695 - 4203",null,"(484) 695 - 4203",null,null,"y",null,null,626,{"$f":"IF(ISNA(MATCH(A554, Application.!A:A, 0)), \"\", MATCH(A554, Application.!A:A, 0))","v":595}]
[555,"  ","i ","   "," e",null,"Email:","ccasey@lutron.com",null,"ccasey@lutron.com",null,null,"y",null,null,627,{"$f":"IF(ISNA(MATCH(A555, Application.!A:A, 0)), \"\", MATCH(A555, Application.!A:A, 0))","v":596}]
[556,"  ","\n \n i ","   "," e","Name of Control System being submitted.\nThis is the primary product and marketing name for the whole system; not detailed names of particular system components.  The complete system is marketed under this name.",null,"Vive Wireless Solutions",null,"Vive Wireless Solutions",null,null,"y",null,null,628,{"$f":"IF(ISNA(MATCH(A556, Application.!A:A, 0)), \"\", MATCH(A556, Application.!A:A, 0))","v":597}]
[557,"  "," ","   "," e","Application ",null,"Select all that apply",null,null,null,null,null,null,null,629,{"$f":"IF(ISNA(MATCH(A557, Application.!A:A, 0)), \"\", MATCH(A557, Application.!A:A, 0))","v":598}]
[558,"  ","i ","   ",null,null,"Interior",null,true,{"$f":"IF(I558=TRUE,\"Yes\", \"No\")","v":"Yes"},null,null,"y",null,null,630,{"$f":"IF(ISNA(MATCH(A558, Application.!A:A, 0)), \"\", MATCH(A558, Application.!A:A, 0))","v":599}]
[559,"  ",null,"   "," e",null,"Exterior",null,false,{"$f":"IF(I559=TRUE,\"Yes\", \"No\")","v":"No"},null,null,null,null,null,631,{"$f":"IF(ISNA(MATCH(A559, Application.!A:A, 0)), \"\", MATCH(A559, Application.!A:A, 0))","v":600}]
[560,"  ","i ","   "," e","How will the application invoice be paid?",null,"Choose 1 from dropdown menu",null,null,null,null,null,null,null,634,{"$f":"IF(ISNA(MATCH(A560, Application.!A:A, 0)), \"\", MATCH(A560, Application.!A:A, 0))","v":601}]
[561,"  ","i ","   "," e",null,"Check, EFT, or Credit Card","EFT",null,{"$f":"H561","v":"EFT"},null,null,"y",null,null,635,{"$f":"IF(ISNA(MATCH(A561, Application.!A:A, 0)), \"\", MATCH(A561, Application.!A:A, 0))","v":""}]
[562,"  ","i ","   ",null,"Interior System Scope/Scale ",null,"Select all that apply",null,null,null,null,null,null,null,636,{"$f":"IF(ISNA(MATCH(A562, Application.!A:A, 0)), \"\", MATCH(A562, Application.!A:A, 0))","v":""}]
[563,"  ","i ","   ",null,null,"Portfolio/Enterprise Level",null,false,{"$f":"IF(I563=TRUE,\"Yes\", \"No\")","v":"No"},null,null,null,null,null,637,{"$f":"IF(ISNA(MATCH(A563, Application.!A:A, 0)), \"\", MATCH(A563, Application.!A:A, 0))","v":""}]
[564,"  ","i ","   ",null,null,"Building Level",null,true,"Yes","05-Brochure, page 3",null,"y","05p3",null,638,{"$f":"IF(ISNA(MATCH(A564, Application.!A:A, 0)), \"\", MATCH(A564, Application.!A:A, 0))","v":""}]
[565,"I",null,"   ",null,null,"Room Level",null,true,"Yes","05-Brochure, page 3",null,"y","05p3",null,639,{"$f":"IF(ISNA(MATCH(A565, Application.!A:A, 0)), \"\", MATCH(A565, Application.!A:A, 0))","v":""}]
[566,null,null," ","e","Exterior System Application ",null,"Select all that apply",null,null,null,null,null,null,null,643,{"$f":"IF(ISNA(MATCH(A566, Application.!A:A, 0)), \"\", MATCH(A566, Application.!A:A, 0))","v":""}]
[567,null,null," ","e",null,"Area/Building Exterior/Parking/Structured Parking",null,false,"No",null,null,null,null,null,645,{"$f":"IF(ISNA(MATCH(A567, Application.!A:A, 0)), \"\", MATCH(A567, Application.!A:A, 0))","v":""}]
[568,null,null," ","e",null,"Roadway  (highways)",null,false,"No",null,null,null,null,null,646,{"$f":"IF(ISNA(MATCH(A568, Application.!A:A, 0)), \"\", MATCH(A568, Application.!A:A, 0))","v":""}]
[569,null,null," ","e",null,"Streetlight (residential streets)",null,false,"No",null,null,null,null,null,647,{"$f":"IF(ISNA(MATCH(A569, Application.!A:A, 0)), \"\", MATCH(A569, Application.!A:A, 0))","v":""}]
[570,null,null," ","e",null,"Smart City",null,false,"No",null,null,null,null,null,648,{"$f":"IF(ISNA(MATCH(A570, Application.!A:A, 0)), \"\", MATCH(A570, Application.!A:A, 0))","v":""}]
[571,"  ","i ","   "," e","Product website",null,"www.lutron.com/vive",null,"No",null,null,null,null,null,649,{"$f":"IF(ISNA(MATCH(A571, Application.!A:A, 0)), \"\", MATCH(A571, Application.!A:A, 0))","v":""}]
[572," I \n\n  ","\n   \n ","E\n \n \n \n","\n    \n ","Do all system components have a warranty of 5 years or more, including any 3rd party components that are needed to meet minimum required DLC capabilities (with the possible exception of software, on-premises server, and cloud service)?  Attach the warranty.",null,null,true,"Yes","02-Hub Spec Submittal, Page 3, Warranty, 23-Wallbox Warranty; 05-Brochure, page 49",null,"y","05p49 (pdf25): \"Vive wireless solutions are all covered by a 5-year parts warranty with registration of the product. Additional technology support options are available to meet your project needs.\"","Please written warranty documentation for the products included in the \"Vive Wireless Solutions\"",650,{"$f":"IF(ISNA(MATCH(A572, Application.!A:A, 0)), \"\", MATCH(A572, Application.!A:A, 0))","v":""}]
[573,"  \n ","i \n ","   \n "," e","Does an extended warranty need to be purchased, to meet the 5 year requirement?",null,null,false,"No","Product needs to be registered, but no additional payment is required",null,"y","See O572",null,651,{"$f":"IF(ISNA(MATCH(A573, Application.!A:A, 0)), \"\", MATCH(A573, Application.!A:A, 0))","v":""}]
[574,"  ","i ","   ","e",null,"If so, what is the standard warranty length?","5 Years \nProduct registration is required.\n",null,{"$f":"H574","v":"5 Years \nProduct registration is required.\n"},null,null,"y","NOTE for QPL:  fix this in the QPL, so this phrase goes in row 573.","Product needs to be registered, but no additional payment is required",652,{"$f":"IF(ISNA(MATCH(A574, Application.!A:A, 0)), \"\", MATCH(A574, Application.!A:A, 0))","v":""}]
[575,"  \n ","i \n ","   \n "," e","Technical support phone number for troubleshooting this system:",null,"1 (800) 523-9466",null,{"$f":"H575","v":"1 (800) 523-9466"},null,null,"y",null,null,653,{"$f":"IF(ISNA(MATCH(A575, Application.!A:A, 0)), \"\", MATCH(A575, Application.!A:A, 0))","v":""}]
[576,"   \n \n \n ","i  \n \n \n ","    \n \n \n "," e \n \n ","Is this a private-label system?  If so, provide a copy of your agreement with the Original Equipment Manufacturer, as the Reference Document.",null,null,false,{"$f":"IF(I576=TRUE,\"Yes\", \"No\")","v":"No"},null,null,null,null,null,654,{"$f":"IF(ISNA(MATCH(A576, Application.!A:A, 0)), \"\", MATCH(A576, Application.!A:A, 0))","v":""}]
[577,"  \n ","i \n ","   \n "," e","Is this system a combination of products from multiple manufacturers? ",null,null,false,{"$f":"IF(I577=TRUE,\"Yes\", \"No\")","v":"No"},null,null,null,null,null,655,{"$f":"IF(ISNA(MATCH(A577, Application.!A:A, 0)), \"\", MATCH(A577, Application.!A:A, 0))","v":""}]
[578,"  \n ","i \n ","   \n "," e",null," If so, please provide a list of all manufacturers.",null,null,{"$f":"H578","v":0},null,null,null,null,null,656,{"$f":"IF(ISNA(MATCH(A578, Application.!A:A, 0)), \"\", MATCH(A578, Application.!A:A, 0))","v":""}]
[579,"  \n ","\n i \n \n ","   \n "," e","Provide any case studies in North America available for this system, with URL if available online.",null,"http://www.lutron.com/TechnicalDocumentLibrary/3684466_Franklin_and_Marshall_Case_Study.pdf",null,{"$f":"H579","v":"http://www.lutron.com/TechnicalDocumentLibrary/3684466_Franklin_and_Marshall_Case_Study.pdf"},null,null,"y",null,null,657,{"$f":"IF(ISNA(MATCH(A579, Application.!A:A, 0)), \"\", MATCH(A579, Application.!A:A, 0))","v":""}]
[580,null,"i \n \n ","\n "," e\n\n  \n ",null,"If no case studies are available, provide a source where the system is commercially available for purchase.  \nOR, to help expedite system qualification, provide a copy of a paid invoice showing that a system has been sold to a customer.",null,null,{"$f":"H580","v":0},null,null,null,null,null,658,{"$f":"IF(ISNA(MATCH(A580, Application.!A:A, 0)), \"\", MATCH(A580, Application.!A:A, 0))","v":""}]
[581,"   \n \n \n \n \n","i \n \n \n \n \n","  \n \n \n \n \n"," \n \n e \n \n \n\n  \n",null,"If no case studies are available, then provide a customer reference (name, phone, email) that DLC may contact. DLC will not share this contact with any other parties.  A beta site with a pre-production system is acceptable. DLC wishes to confirm that the system has been installed and operated successfully in at least one actual field installation.  DLC WILL VERIFY THAT EACH OF THE \"REQUIRED CAPABILITIES\" HAVE BEEN DEMONSTRATED WITH EITHER A CASE STUDY OR A CUSTOMER REFERENCE.",null,null,{"$f":"H581","v":0},null,null,null,null,null,659,{"$f":"IF(ISNA(MATCH(A581, Application.!A:A, 0)), \"\", MATCH(A581, Application.!A:A, 0))","v":""}]
[582,"I \n \n \n   \n \n","  \n \n \n   \n \n","E\n \n \n   \n \n","   \n \n \n   \n \n","System Overview Presentation:  As part of the Application Review Process, to help DLC understand the system, the applicant will conduct a 1 to 2 hour overview of the system for DLC via webinar.  This will be scheduled and completed after the Application Form has  been submitted.  See the \"Presentation\" worksheet for more details",null,null,null,null,null,null,null,null,null,660,{"$f":"IF(ISNA(MATCH(A582, Application.!A:A, 0)), \"\", MATCH(A582, Application.!A:A, 0))","v":""}]
[583,"I ","  ","E","   ","23)","Manufacturer and System ",null,null,null,null,null,null,null,null,661,{"$f":"IF(ISNA(MATCH(A583, Application.!A:A, 0)), \"\", MATCH(A583, Application.!A:A, 0))","v":""}]

{"sheet":"Instructions.","index":1,"n_rows":0,"n_cols":0,"rows_kept":0,"cut":false,"hidden":false,"merged":[]}

{"sheet":"Application.","index":2,"n_rows":601,"n_cols":25,"rows_kept":601,"cut":false,"hidden":false,"merged":[[94,6,94,7],[314,6,314,7],[142,6,142,7],[143,6,143,7],[144,6,144,7],[146,6,146,7],[458,6,458,7],[312,6,312,7],[115,6,115,7],[116,6,116,7],[117,6,117,7],[119,6,119,7],[120,6,120,7],[123,6,123,7],[124,6,124,7],[129,6,129,7],[130,6,130,7],[131,6,131,7],[134,6,134,7],[163,6,163,7],[168,6,168,7],[140,6,140,7],[326,6,326,7],[327,6,327,7],[0,6,0,7],[2,6,2,7],[3,6,3,7],[4,6,4,7],[9,6,9,7],[14,6,14,7],[24,6,24,7],[29,6,29,7],[46,6,46,7],[17,6,17,7],[97,6,97,7],[51,6,51,7],[159,6,159,7],[107,6,107,7],[108,6,108,7],[109,6,109,7],[56,6,56,7],[135,6,135,7],[138,6,138,7],[139,6,139,7],[157,6,157,7],[158,6,158,7],[141,6,141,7],[147,6,147,7],[127,6,127,7],[128,6,128,7],[64,6,64,7],[65,6,65,7],[66,6,66,7],[67,6,67,7],[74,6,74,7],[81,6,81,7],[87,6,87,7],[93,6,93,7],[540,6,540,7],[384,6,384,7],[385,6,385,7],[386,6,386,7],[337,6,337,7],[316,6,316,7],[311,6,311,7],[255,6,255,7],[169,6,169,7],[170,6,170,7],[183,6,183,7],[184,6,184,7],[185,6,185,7],[186,6,186,7],[188,6,188,7],[189,6,189,7],[198,6,198,7],[199,6,199,7],[200,6,200,7],[205,6,205,7],[213,6,213,7],[214,6,214,7],[215,6,215,7],[222,6,222,7],[599,6,599,7],[589,6,589,7],[590,6,590,7],[592,6,592,7],[593,6,593,7],[594,6,594,7],[596,6,596,7],[541,6,541,7],[542,6,542,7],[546,6,546,7],[591,6,591,7],[549,6,549,7],[550,6,550,7],[551,6,551,7],[553,6,553,7],[558,6,558,7],[567,6,567,7],[587,6,587,7],[539,6,539,7],[256,6,256,7],[259,6,259,7],[260,6,260,7],[261,6,261,7],[271,6,271,7],[284,6,284,7],[285,6,285,7],[297,6,297,7],[299,6,299,7],[300,6,300,7],[303,6,303,7],[304,6,304,7],[305,6,305,7],[306,6,306,7],[309,6,309,7],[310,6,310,7],[531,6,531,7],[500,6,500,7],[503,6,503,7],[504,6,504,7],[505,6,505,7],[342,6,342,7],[343,6,343,7],[429,6,429,7],[525,6,525,7],[526,6,526,7],[527,6,527,7],[485,6,485,7],[467,6,467,7],[476,6,476,7],[477,6,477,7],[481,6,481,7],[484,6,484,7],[457,6,457,7],[516,6,516,7],[517,6,517,7],[466,6,466,7],[486,6,486,7],[496,6,496,7],[99,6,99,7],[191,6,191,7],[190,6,190,7],[315,6,315,7],[394,6,394,7],[395,6,395,7],[397,6,397,7],[426,6,426,7],[428,6,428,7],[340,6,340,7],[341,6,341,7],[350,6,350,7],[354,6,354,7],[359,6,359,7],[365,6,365,7],[366,6,366,7],[367,6,367,7],[371,6,371,7],[380,6,380,7],[224,6,224,7],[328,6,328,7],[353,6,353,7],[381,6,381,7]]}
["Row # V4","Row # V5","Required Interior","reported interior","Required Exterior","reported exterior","Questions",null,"V5 dataname","V5 datatype","V4 Applicant's Answer","V4 Reference","V5 answer","V5 Reference \nFile Number(s), Page(s), Section(s)","V5 T/F","V5\nConvert \nT/F to Y/N","blank","V4 Reviewer acceptance","V5 Reviewer Status  i=internal\nn=no p=propose\nq=qstn\ny=yes","V4 Question, proposal","V4 Note","V5 Reviewer Question, proposal","V5 Reviewer Note","DLC internal use, \nnot for QPL","V4 dataname"]
[2,2,"I  ","   ","E ","    ","1)","Networking of Luminaires and Devices","productId","string",null,null,null,null,null,null,{"$f":"IF(IF(ISNA(INDEX('Application V2'!A:M, MATCH(Application.!A2,'Application V2'!A:A,0),12)), \"\", INDEX('Application V2'!A:M, MATCH(Application.!A2,'Application V2'!A:A,0),12))=0, \"\", IF(ISNA(INDEX('Application V2'!A:M, MATCH(Application.!A2,'Application V2'!A:A,0),12)), \"\", INDEX('Application V2'!A:M, MATCH(Application.!A2,'Application V2'!A:A,0),12)))","v":""},null,null,null,null,null,null,null,"productId"]
[3,3,"\n \n  \n  \n  ","\n \n  \n  \n  ","\n \n  \n  \n  ","\n \n  \n  \n  ","Definition:  The capability of individual luminaires/lamps and control devices to exchange digital data with other luminaires/lamps and control devices on the system. This capability is required at the room, space, or area level, but not at the whole building level or beyond (e.g.  non-lighting systems, or the internet).",null,"blank",null,null,null,null,null,null,null,{"$f":"IF(IF(ISNA(INDEX('Application V2'!A:M, MATCH(Application.!A3,'Application V2'!A:A,0),12)), \"\", INDEX('Application V2'!A:M, MATCH(Application.!A3,'Application V2'!A:A,0),12))=0, \"\", IF(ISNA(INDEX('Application V2'!A:M, MATCH(Application.!A3,'Application V2'!A:A,0),12)), \"\", INDEX('Application V2'!A:M, MATCH(Application.!A3,'Application V2'!A:A,0),12)))","v":""},null,null,null,null,null,null,null,"blank"]
[4,4,"I \n ","  \n ","\n \n E","   \n ","Can individual luminaires and control devices exchange digital data with other luminaires and control devices on the system, at the room or space level?  ",null,"hasNetworking","boolean",null,null,null,null,false,{"$f":"IF(O4=TRUE,\"Yes\", \"No\")","v":"No"},{"$f":"IF(IF(ISNA(INDEX('Application V2'!A:M, MATCH(Application.!A4,'Application V2'!A:A,0),12)), \"\", INDEX('Application V2'!A:M, MATCH(Application.!A4,'Application V2'!A:A,0),12))=0, \"\", IF(ISNA(INDEX('Application V2'!A:M, MATCH(Application.!A4,'Application V2'!A:A,0),12)), \"\", INDEX('Application V2'!A:M, MATCH(Application.!A4,'Application V2'!A:A,0),12)))","v":""},null,null,null,null,null,null,null,"hasNetworking"]
[5,5,"I \n ",null,"\n\n  \n E"," ","What are the size limitations of the data communication system, in terms of number of edge devices recommended for optimal performance? (answer Rows 6-8 with numbers, or leave blank and explain in Row 9).  Edge devices include luminaires, switches, standalone sensors, shades, plug load controllers, etc.",null,"blank",null,null,null,null,null,null,null,{"$f":"IF(IF(ISNA(INDEX('Application V2'!A:M, MATCH(Application.!A5,'Application V2'!A:A,0),12)), \"\", INDEX('Application V2'!A:M, MATCH(Application.!A5,'Application V2'!A:A,0),12))=0, \"\", IF(ISNA(INDEX('Application V2'!A:M, MATCH(Application.!A5,'Application V2'!A:A,0),12)), \"\", INDEX('Application V2'!A:M, MATCH(Application.!A5,'Application V2'!A:A,0),12)))","v":""},null,null,null,null,null,null,null,"blank"]
[6,6,"  ","i ","   "," e",null,"# of edge devices  per network","netDevicesNum","integer",null,null,null,null,null,{"$f":"IF(ISBLANK(M6),\"\",M6)","v":""},{"$f":"IF(IF(ISNA(INDEX('Application V2'!A:M, MATCH(Application.!A6,'Application V2'!A:A,0),12)), \"\", INDEX('Application V2'!A:M, MATCH(Application.!A6,'Application V2'!A:A,0),12))=0, \"\", IF(ISNA(INDEX('Application V2'!A:M, MATCH(Application.!A6,'Application V2'!A:A,0),12)), \"\", INDEX('Application V2'!A:M, MATCH(Application.!A6,'Application V2'!A:A,0),12)))","v":""},null,null,null,null,null,null,null,"netDevicesNum"]
[7,7,"  ","i ","   "," e",null,"# of edge devices per onsite system with a central UI ","netDevicesNumOnsite ","integer",null,null,null,null,null,{"$f":"IF(ISBLANK(M7),\"\",M7)","v":""},{"$f":"IF(IF(ISNA(INDEX('Application V2'!A:M, MATCH(Application.!A7,'Application V2'!A:A,0),12)), \"\", INDEX('Application V2'!A:M, MATCH(Application.!A7,'Application V2'!A:A,0),12))=0, \"\", IF(ISNA(INDEX('Application V2'!A:M, MATCH(Application.!A7,'Application V2'!A:A,0),12)), \"\", INDEX('Application V2'!A:M, MATCH(Application.!A7,'Application V2'!A:A,0),12)))","v":""},null,null,null,null,null,null,null,"netDevicesNumOnsite "]
[8,8,"  ","i ","   "," e",null,"# of edge devices per cloud system with a central UI ","netDevicesNumCloud","integer",null,null,null,null,null,"",{"$f":"IF(IF(ISNA(INDEX('Application V2'!A:M, MATCH(Application.!A8,'Application V2'!A:A,0),12)), \"\", INDEX('Application V2'!A:M, MATCH(Application.!A8,'Application V2'!A:A,0),12))=0, \"\", IF(ISNA(INDEX('Application V2'!A:M, MATCH(Application.!A8,'Application V2'!A:A,0),12)), \"\", INDEX('Application V2'!A:M, MATCH(Application.!A8,'Application V2'!A:A,0),12)))","v":""},null,null,null,null,null,null,null,"netDevicesNumCloud"]
[9,9,"  ","i ","   "," e",null,"Notes if needed.  For instance, varies by wired/wireless or interior/exterior? If # of devices is \"Unlimited\", leave questions above blank, and write \"Unlimited\" here.","netDevicesNumText","text",null,null,null,null,null,"",{"$f":"IF(IF(ISNA(INDEX('Application V2'!A:M, MATCH(Application.!A9,'Application V2'!A:A,0),12)), \"\", INDEX('Application V2'!A:M, MATCH(Application.!A9,'Application V2'!A:A,0),12))=0, \"\", IF(ISNA(INDEX('Application V2'!A:M, MATCH(Application.!A9,'Application V2'!A:A,0),12)), \"\", INDEX('Application V2'!A:M, MATCH(Application.!A9,'Application V2'!A:A,0),12)))","v":""},null,null,null,null,null,null,null,"netDevicesNumText"]
[10,10,"  ","i ","   "," e","What is the maximum recommended distance between components?",null,"blank",null,null,null,null,null,null,null,{"$f":"IF(IF(ISNA(INDEX('Application V2'!A:M, MATCH(Application.!A10,'Application V2'!A:A,0),12)), \"\", INDEX('Application V2'!A:M, MATCH(Application.!A10,'Application V2'!A:A,0),12))=0, \"\", IF(ISNA(INDEX('Application V2'!A:M, MATCH(Application.!A10,'Application V2'!A:A,0),12)), \"\", INDEX('Application V2'!A:M, MATCH(Application.!A10,'Application V2'!A:A,0),12)))","v":""},null,null,null,null,null,null,null,"blank"]
[11,11,"  ","i ","   "," e",null,"Distance between wireless nodes, typical interior obstructions (feet)","netDistanceWirelessWithObstructionsFt","integer",null,null,null,null,null,"",{"$f":"IF(IF(ISNA(INDEX('Application V2'!A:M, MATCH(Application.!A11,'Application V2'!A:A,0),12)), \"\", INDEX('Application V2'!A:M, MATCH(Application.!A11,'Application V2'!A:A,0),12))=0, \"\", IF(ISNA(INDEX('Application V2'!A:M, MATCH(Application.!A11,'Application V2'!A:A,0),12)), \"\", INDEX('Application V2'!A:M, MATCH(Application.!A11,'Application V2'!A:A,0),12)))","v":""},null,null,null,null,null,null,null,"netDistanceWirelessWithObstructionsFt"]
[12,12,"  \n \n",null,"   \n \n"," e",null,"Distance between wireless nodes, clear line of sight (feet) (Exterior only)","netDistanceWirelessNoObstructionsFt","integer",null,null,null,null,null,"",{"$f":"IF(IF(ISNA(INDEX('Application V2'!A:M, MATCH(Application.!A12,'Application V2'!A:A,0),12)), \"\", INDEX('Application V2'!A:M, MATCH(Application.!A12,'Application V2'!A:A,0),12))=0, \"\", IF(ISNA(INDEX('Application V2'!A:M, MATCH(Application.!A12,'Application V2'!A:A,0),12)), \"\", INDEX('Application V2'!A:M, MATCH(Application.!A12,'Application V2'!A:A,0),12)))","v":""},null,null,null,null,null,null,null,"netDistanceWirelessNoObstructionsFt"]
[13,13,"  ","i ","   "," e",null,"Distance between wired nodes (feet)","netDistanceWired","integer",null,null,null,null,null,"",{"$f":"IF(IF(ISNA(INDEX('Application V2'!A:M, MATCH(Application.!A13,'Application V2'!A:A,0),12)), \"\", INDEX('Application V2'!A:M, MATCH(Application.!A13,'Application V2'!A:A,0),12))=0, \"\", IF(ISNA(INDEX('Application V2'!A:M, MATCH(Application.!A13,'Application V2'!A:A,0),12)), \"\", INDEX('Application V2'!A:M, MATCH(Application.!A13,'Application V2'!A:A,0),12)))","v":""},null,null,null,null,null,null,null,"netDistanceWired"]
[14,14,"  ","i ","   "," e",null,"Notes if needed","netDistanceNotes","text",null,null,null,null,null,"",{"$f":"IF(IF(ISNA(INDEX('Application V2'!A:M, MATCH(Application.!A14,'Application V2'!A:A,0),12)), \"\", INDEX('Application V2'!A:M, MATCH(Application.!A14,'Application V2'!A:A,0),12))=0, \"\", IF(ISNA(INDEX('Application V2'!A:M, MATCH(Application.!A14,'Application V2'!A:A,0),12)), \"\", INDEX('Application V2'!A:M, MATCH(Application.!A14,'Application V2'!A:A,0),12)))","v":""},null,null,null,null,null,null,null,"netDistanceNotes"]
[15,15,"  ","i ","   "," e","Is control communication to edge devices wired, wireless or both?",null,"netEdgeConcat","concat 16:17",null,null,"Select all that apply",null,null,null,{"$f":"IF(IF(ISNA(INDEX('Application V2'!A:M, MATCH(Application.!A15,'Application V2'!A:A,0),12)), \"\", INDEX('Application V2'!A:M, MATCH(Application.!A15,'Application V2'!A:A,0),12))=0, \"\", IF(ISNA(INDEX('Application V2'!A:M, MATCH(Application.!A15,'Application V2'!A:A,0),12)), \"\", INDEX('Application V2'!A:M, MATCH(Application.!A15,'Application V2'!A:A,0),12)))","v":""},null,null,null,null,null,null,null,"netEdgeConcat"]
[16,16,"  ","i ","   "," e",null,"Wired","netEdgeWired","boolean",null,null,null,null,false,{"$f":"IF(O16=TRUE,\"Yes\", \"No\")","v":"No"},{"$f":"IF(IF(ISNA(INDEX('Application V2'!A:M, MATCH(Application.!A16,'Application V2'!A:A,0),12)), \"\", INDEX('Application V2'!A:M, MATCH(Application.!A16,'Application V2'!A:A,0),12))=0, \"\", IF(ISNA(INDEX('Application V2'!A:M, MATCH(Application.!A16,'Application V2'!A:A,0),12)), \"\", INDEX('Application V2'!A:M, MATCH(Application.!A16,'Application V2'!A:A,0),12)))","v":""},null,null,null,null,null,null,null,"netEdgeWired"]
[17,17,"  ","i ","   "," e",null,"Wireless","netEdgeWireless","boolean",null,null,null,null,false,{"$f":"IF(O17=TRUE,\"Yes\", \"No\")","v":"No"},{"$f":"IF(IF(ISNA(INDEX('Application V2'!A:M, MATCH(Application.!A17,'Application V2'!A:A,0),12)), \"\", INDEX('Application V2'!A:M, MATCH(Application.!A17,'Application V2'!A:A,0),12))=0, \"\", IF(ISNA(INDEX('Application V2'!A:M, MATCH(Application.!A17,'Application V2'!A:A,0),12)), \"\", INDEX('Application V2'!A:M, MATCH(Application.!A17,'Application V2'!A:A,0),12)))","v":""},null,null,null,null,null,null,null,"netEdgeWireless"]
[17.100000000000001,18,null,null,null,null,"For wired communication, what wiring media type(s) does the communication between the edge devices (luminaires, sensors) and their coordinator (gateway, server, or peer) use?",null,"netwComplyConcat","concat 19:24",null,null,null,null,null,{"$f":"IF(O18=TRUE,\"Yes\", \"No\")","v":"No"}]
[17.2,19,null,"i ","   "," e",null,"Twisted Pair","netwComplyTwisted","boolean",null,null,null,null,false,"No"]
[17.3,20,null,"i ","   "," e",null,"3-Wire","netwComply3-Wire","boolean",null,null,null,null,false,"No"]
[17.399999999999999,21,null,"i ","   "," e",null,"CAT 6 (Ethernet type)","netwComplyCAT6","boolean",null,null,null,null,false,"No"]
[25,22,null,"i ","   "," e",null,"PLC (Power Line Comm.)","netComplyPlc","boolean",null,null,null,null,false,{"$f":"IF(O22=TRUE,\"Yes\", \"No\")","v":"No"},{"$f":"IF(IF(ISNA(INDEX('Application V2'!A:M, MATCH(Application.!A22,'Application V2'!A:A,0),12)), \"\", INDEX('Application V2'!A:M, MATCH(Application.!A22,'Application V2'!A:A,0),12))=0, \"\", IF(ISNA(INDEX('Application V2'!A:M, MATCH(Application.!A22,'Application V2'!A:A,0),12)), \"\", INDEX('Application V2'!A:M, MATCH(Application.!A22,'Application V2'!A:A,0),12)))","v":""},null,null,null,null,null,null,null,"netComplyPlc"]
[17.600000000000001,23,null,"i ","   "," e",null,"Fiber Optic","netwComplyFiber","boolean",null,null,null,null,false,"No"]
[17.7,24,null,"i ","   "," e",null,"Other (explain)","netwComplyOther","text",null,null,null,null,null,{"$f":"IF(ISBLANK(M24),\"\",M24)","v":""}]
[18,25,"  ","\ni  \n .","   "," e","For the networking components, describe briefly how software and firmware is upgraded and under what circumstance and/or frequency.  (This question is for DLC internal use only, to guide development of future requirements. Not for publication on QPL).",null,"netUpgradeText","text",null,null,null,null,null,{"$f":"IF(ISBLANK(M25),\"\",M25)","v":""},{"$f":"IF(IF(ISNA(INDEX('Application V2'!A:M, MATCH(Application.!A25,'Application V2'!A:A,0),12)), \"\", INDEX('Application V2'!A:M, MATCH(Application.!A25,'Application V2'!A:A,0),12))=0, \"\", IF(ISNA(INDEX('Application V2'!A:M, MATCH(Application.!A25,'Application V2'!A:A,0),12)), \"\", INDEX('Application V2'!A:M, MATCH(Application.!A25,'Application V2'!A:A,0),12)))","v":""},null,null,null,null,null,null,1,"netUpgradeText"]
[19,26,"  ","i ","   "," e",null,"Edge devices","netUpgradeEdge","text",null,null,null,null,null,{"$f":"IF(ISBLANK(M26),\"\",M26)","v":""},{"$f":"IF(IF(ISNA(INDEX('Application V2'!A:M, MATCH(Application.!A26,'Application V2'!A:A,0),12)), \"\", INDEX('Application V2'!A:M, MATCH(Application.!A26,'Application V2'!A:A,0),12))=0, \"\", IF(ISNA(INDEX('Application V2'!A:M, MATCH(Application.!A26,'Application V2'!A:A,0),12)), \"\", INDEX('Application V2'!A:M, MATCH(Application.!A26,'Application V2'!A:A,0),12)))","v":""},null,null,null,null,null,null,1,"netUpgradeEdge"]
[20,27,"  ","i ","   "," e",null,"Gateway (if part of the networking components)","netUpgradeGateway","text",null,null,null,null,null,{"$f":"IF(ISBLANK(M27),\"\",M27)","v":""},{"$f":"IF(IF(ISNA(INDEX('Application V2'!A:M, MATCH(Application.!A27,'Application V2'!A:A,0),12)), \"\", INDEX('Application V2'!A:M, MATCH(Application.!A27,'Application V2'!A:A,0),12))=0, \"\", IF(ISNA(INDEX('Application V2'!A:M, MATCH(Application.!A27,'Application V2'!A:A,0),12)), \"\", INDEX('Application V2'!A:M, MATCH(Application.!A27,'Application V2'!A:A,0),12)))","v":""},null,null,null,null,null,null,1,"netUpgradeGateway"]
[21,28,"  ","i ","   "," e",null,"On-premises server/bridge (if part of the networking components)","netUpgradeServerLocal","text",null,null,null,null,null,"",{"$f":"IF(IF(ISNA(INDEX('Application V2'!A:M, MATCH(Application.!A28,'Application V2'!A:A,0),12)), \"\", INDEX('Application V2'!A:M, MATCH(Application.!A28,'Application V2'!A:A,0),12))=0, \"\", IF(ISNA(INDEX('Application V2'!A:M, MATCH(Application.!A28,'Application V2'!A:A,0),12)), \"\", INDEX('Application V2'!A:M, MATCH(Application.!A28,'Application V2'!A:A,0),12)))","v":""},null,null,null,null,null,null,1,"netUpgradeServerLocal"]
[22,29,"  ","i ","   "," e",null,"Cloud server","netUpgradeServerCloud","text",null,null,null,null,null,"",{"$f":"IF(IF(ISNA(INDEX('Application V2'!A:M, MATCH(Application.!A29,'Application V2'!A:A,0),12)), \"\", INDEX('Application V2'!A:M, MATCH(Application.!A29,'Application V2'!A:A,0),12))=0, \"\", IF(ISNA(INDEX('Application V2'!A:M, MATCH(Application.!A29,'Application V2'!A:A,0),12)), \"\", INDEX('Application V2'!A:M, MATCH(Application.!A29,'Application V2'!A:A,0),12)))","v":""},null,null,null,null,null,null,1,"netUpgradeServerCloud"]
[23,30,"  ","\ni  \n  ","   "," e","What standards and/or protocols does the communication between the edge devices (luminaires, sensors) and their coordinator (gateway, server, or peer) comply with?   (not including required regulatory communication standards  such as FCC and IC). ",null,"netComplyConcat","concat 31:42",null,null,"Select all that apply",null,null,null,{"$f":"IF(IF(ISNA(INDEX('Application V2'!A:M, MATCH(Application.!A30,'Application V2'!A:A,0),12)), \"\", INDEX('Application V2'!A:M, MATCH(Application.!A30,'Application V2'!A:A,0),12))=0, \"\", IF(ISNA(INDEX('Application V2'!A:M, MATCH(Application.!A30,'Application V2'!A:A,0),12)), \"\", INDEX('Application V2'!A:M, MATCH(Application.!A30,'Application V2'!A:A,0),12)))","v":""},null,null,null,null,null,null,null,"netComplyConcat"]
[26,31,"  ","i ","   ",null,null,"BlueTooth Low Energy BLE (dropdown menu)","netComplyBlueToothBleV4","text",null,null,null,null,null,"",{"$f":"IF(IF(ISNA(INDEX('Application V2'!A:M, MATCH(Application.!A31,'Application V2'!A:A,0),12)), \"\", INDEX('Application V2'!A:M, MATCH(Application.!A31,'Application V2'!A:A,0),12))=0, \"\", IF(ISNA(INDEX('Application V2'!A:M, MATCH(Application.!A31,'Application V2'!A:A,0),12)), \"\", INDEX('Application V2'!A:M, MATCH(Application.!A31,'Application V2'!A:A,0),12)))","v":""},null,null,null,null,null,null,null,"netComplyBlueToothBleV4"]
[24,32,"  ","i ","   "," e",null,"Cellular (3G, 4G, 5G)","netComply3GPP","boolean",null,null,null,null,false,{"$f":"IF(O32=TRUE,\"Yes\", \"No\")","v":"No"},{"$f":"IF(IF(ISNA(INDEX('Application V2'!A:M, MATCH(Application.!A32,'Application V2'!A:A,0),12)), \"\", INDEX('Application V2'!A:M, MATCH(Application.!A32,'Application V2'!A:A,0),12))=0, \"\", IF(ISNA(INDEX('Application V2'!A:M, MATCH(Application.!A32,'Application V2'!A:A,0),12)), \"\", INDEX('Application V2'!A:M, MATCH(Application.!A32,'Application V2'!A:A,0),12)))","v":""},null,null,null,null,null,null,null,"netComply3GPP"]
[28,33,"  ","i ","   "," e",null,"DALI","netComplyDALI","boolean",null,null,null,null,false,{"$f":"IF(O33=TRUE,\"Yes\", \"No\")","v":"No"},{"$f":"IF(IF(ISNA(INDEX('Application V2'!A:M, MATCH(Application.!A33,'Application V2'!A:A,0),12)), \"\", INDEX('Application V2'!A:M, MATCH(Application.!A33,'Application V2'!A:A,0),12))=0, \"\", IF(ISNA(INDEX('Application V2'!A:M, MATCH(Application.!A33,'Application V2'!A:A,0),12)), \"\", INDEX('Application V2'!A:M, MATCH(Application.!A33,'Application V2'!A:A,0),12)))","v":""},null,null,null,null,null,null,null,"netComplyDALI"]
[29,34,"  ","i ","   "," e",null,"DALI2","netComplyDALI2","boolean",null,null,null,null,false,"No",{"$f":"IF(IF(ISNA(INDEX('Application V2'!A:M, MATCH(Application.!A34,'Application V2'!A:A,0),12)), \"\", INDEX('Application V2'!A:M, MATCH(Application.!A34,'Application V2'!A:A,0),12))=0, \"\", IF(ISNA(INDEX('Application V2'!A:M, MATCH(Application.!A34,'Application V2'!A:A,0),12)), \"\", INDEX('Application V2'!A:M, MATCH(Application.!A34,'Application V2'!A:A,0),12)))","v":""},null,null,null,null,null,null,null,"netComplyDALI2"]
[29.1,35,null,"i",null,"e",null,"D4i","netComplyD4i","boolean",null,null,null,null,false,"No"]
[30,36,"  ","i ","   "," e",null,"enOcean","netComplyEnOcean","boolean",null,null,null,null,false,"No",{"$f":"IF(IF(ISNA(INDEX('Application V2'!A:M, MATCH(Application.!A36,'Application V2'!A:A,0),12)), \"\", INDEX('Application V2'!A:M, MATCH(Application.!A36,'Application V2'!A:A,0),12))=0, \"\", IF(ISNA(INDEX('Application V2'!A:M, MATCH(Application.!A36,'Application V2'!A:A,0),12)), \"\", INDEX('Application V2'!A:M, MATCH(Application.!A36,'Application V2'!A:A,0),12)))","v":""},null,null,null,null,null,null,null,"netComplyEnOcean"]
[31,37,"  ","i ","   "," e",null,"KNX","netComplyKNX","boolean",null,null,null,null,false,"No",{"$f":"IF(IF(ISNA(INDEX('Application V2'!A:M, MATCH(Application.!A37,'Application V2'!A:A,0),12)), \"\", INDEX('Application V2'!A:M, MATCH(Application.!A37,'Application V2'!A:A,0),12))=0, \"\", IF(ISNA(INDEX('Application V2'!A:M, MATCH(Application.!A37,'Application V2'!A:A,0),12)), \"\", INDEX('Application V2'!A:M, MATCH(Application.!A37,'Application V2'!A:A,0),12)))","v":""},null,null,null,null,null,null,null,"netComplyKNX"]
[31.1,38,null,"i ",null,"e",null,"POE","netComplyPOE","boolean",null,null,null,null,false,"No"]
[32,39,"  ","i ","   "," e",null,"Proprietary","netComplyProprietary","boolean",null,null,null,null,false,"No",{"$f":"IF(IF(ISNA(INDEX('Application V2'!A:M, MATCH(Application.!A39,'Application V2'!A:A,0),12)), \"\", INDEX('Application V2'!A:M, MATCH(Application.!A39,'Application V2'!A:A,0),12))=0, \"\", IF(ISNA(INDEX('Application V2'!A:M, MATCH(Application.!A39,'Application V2'!A:A,0),12)), \"\", INDEX('Application V2'!A:M, MATCH(Application.!A39,'Application V2'!A:A,0),12)))","v":""},null,null,null,null,null,null,null,"netComplyProprietary"]
[33,40,"  ","i ","   "," e",null,"Zigbee HA","netComplyZigbeeHA ","boolean",null,null,null,null,false,"No",{"$f":"IF(IF(ISNA(INDEX('Application V2'!A:M, MATCH(Application.!A40,'Application V2'!A:A,0),12)), \"\", INDEX('Application V2'!A:M, MATCH(Application.!A40,'Application V2'!A:A,0),12))=0, \"\", IF(ISNA(INDEX('Application V2'!A:M, MATCH(Application.!A40,'Application V2'!A:A,0),12)), \"\", INDEX('Application V2'!A:M, MATCH(Application.!A40,'Application V2'!A:A,0),12)))","v":""},null,null,null,null,null,null,null,"netComplyZigbeeHA "]
[34,41,"  ","i ","   "," e",null,"Zigbee 3.0","netComplyZigbee3","boolean",null,null,null,null,false,"No",{"$f":"IF(IF(ISNA(INDEX('Application V2'!A:M, MATCH(Application.!A41,'Application V2'!A:A,0),12)), \"\", INDEX('Application V2'!A:M, MATCH(Application.!A41,'Application V2'!A:A,0),12))=0, \"\", IF(ISNA(INDEX('Application V2'!A:M, MATCH(Application.!A41,'Application V2'!A:A,0),12)), \"\", INDEX('Application V2'!A:M, MATCH(Application.!A41,'Application V2'!A:A,0),12)))","v":""},null,null,null,null,null,null,null,"netComplyZigbee3"]
[35,42,"  ","i ","   "," e",null,"Other (explain)","netComplyNetworkOtherText","text",null,null,null,null,null,{"$f":"IF(ISBLANK(M42),\"\",M42)","v":""},{"$f":"IF(IF(ISNA(INDEX('Application V2'!A:M, MATCH(Application.!A42,'Application V2'!A:A,0),12)), \"\", INDEX('Application V2'!A:M, MATCH(Application.!A42,'Application V2'!A:A,0),12))=0, \"\", IF(ISNA(INDEX('Application V2'!A:M, MATCH(Application.!A42,'Application V2'!A:A,0),12)), \"\", INDEX('Application V2'!A:M, MATCH(Application.!A42,'Application V2'!A:A,0),12)))","v":""},null,null,null,null,null,null,null,"netComplyNetworkOtherText"]
[36,43,null,"i ","   "," e","How is  an edge device added to the network?",null,"netAddConcat","concat 44:46",null,null,null,null,null,null,{"$f":"IF(IF(ISNA(INDEX('Application V2'!A:M, MATCH(Application.!A43,'Application V2'!A:A,0),12)), \"\", INDEX('Application V2'!A:M, MATCH(Application.!A43,'Application V2'!A:A,0),12))=0, \"\", IF(ISNA(INDEX('Application V2'!A:M, MATCH(Application.!A43,'Application V2'!A:A,0),12)), \"\", INDEX('Application V2'!A:M, MATCH(Application.!A43,'Application V2'!A:A,0),12)))","v":""},null,null,null,null,null,null,1,"netAddConcat"]
[37,44,null,"i ","   "," e",null,"Auto-discovered by network","netAddAuto","boolean",null,null,null,null,false,{"$f":"IF(O44=TRUE,\"Yes\", \"No\")","v":"No"},{"$f":"IF(IF(ISNA(INDEX('Application V2'!A:M, MATCH(Application.!A44,'Application V2'!A:A,0),12)), \"\", INDEX('Application V2'!A:M, MATCH(Application.!A44,'Application V2'!A:A,0),12))=0, \"\", IF(ISNA(INDEX('Application V2'!A:M, MATCH(Application.!A44,'Application V2'!A:A,0),12)), \"\", INDEX('Application V2'!A:M, MATCH(Application.!A44,'Application V2'!A:A,0),12)))","v":""},null,null,null,null,null,null,1,"netAddAuto"]
[38,45,null,"i ","   "," e",null,"Manually with UI ","netAddManual","boolean",null,null,null,null,false,{"$f":"IF(O45=TRUE,\"Yes\", \"No\")","v":"No"},{"$f":"IF(IF(ISNA(INDEX('Application V2'!A:M, MATCH(Application.!A45,'Application V2'!A:A,0),12)), \"\", INDEX('Application V2'!A:M, MATCH(Application.!A45,'Application V2'!A:A,0),12))=0, \"\", IF(ISNA(INDEX('Application V2'!A:M, MATCH(Application.!A45,'Application V2'!A:A,0),12)), \"\", INDEX('Application V2'!A:M, MATCH(Application.!A45,'Application V2'!A:A,0),12)))","v":""},null,null,null,null,null,null,1,"netAddManual"]
[39,46,null,"i ","   "," e",null,"Auto-discovered, plus manual configuration with UI","netAddHybrid","boolean",null,null,null,null,false,{"$f":"IF(O46=TRUE,\"Yes\", \"No\")","v":"No"},{"$f":"IF(IF(ISNA(INDEX('Application V2'!A:M, MATCH(Application.!A46,'Application V2'!A:A,0),12)), \"\", INDEX('Application V2'!A:M, MATCH(Application.!A46,'Application V2'!A:A,0),12))=0, \"\", IF(ISNA(INDEX('Application V2'!A:M, MATCH(Application.!A46,'Application V2'!A:A,0),12)), \"\", INDEX('Application V2'!A:M, MATCH(Application.!A46,'Application V2'!A:A,0),12)))","v":""},null,null,null,null,null,null,1,"netAddHybrid"]
[40,47,"  ","\n i ","   "," e","Does the system offer or require a computer server, either local or cloud-based? Choose 1 best answer from dropdown menu.",null,"netServerConcat","text",null,null,null,null,null,{"$f":"IF(ISBLANK(M47),\"\",M47)","v":""},{"$f":"IF(IF(ISNA(INDEX('Application V2'!A:M, MATCH(Application.!A47,'Application V2'!A:A,0),12)), \"\", INDEX('Application V2'!A:M, MATCH(Application.!A47,'Application V2'!A:A,0),12))=0, \"\", IF(ISNA(INDEX('Application V2'!A:M, MATCH(Application.!A47,'Application V2'!A:A,0),12)), \"\", INDEX('Application V2'!A:M, MATCH(Application.!A47,'Application V2'!A:A,0),12)))","v":""},null,null,null,null,null,null,null,"netServerConcat"]
[41,48,null,"i ","   "," e","Does the system power luminaires with Power over Ethernet (PoE)?",null,"netPoe","boolean",null,null,null,null,false,{"$f":"IF(O48=TRUE,\"Yes\", \"No\")","v":"No"},{"$f":"IF(IF(ISNA(INDEX('Application V2'!A:M, MATCH(Application.!A48,'Application V2'!A:A,0),12)), \"\", INDEX('Application V2'!A:M, MATCH(Application.!A48,'Application V2'!A:A,0),12))=0, \"\", IF(ISNA(INDEX('Application V2'!A:M, MATCH(Application.!A48,'Application V2'!A:A,0),12)), \"\", INDEX('Application V2'!A:M, MATCH(Application.!A48,'Application V2'!A:A,0),12)))","v":""},null,null,null,null,null,null,null,"netPoe"]
[42,49,null,"i ","   "," e",null,"What standard(s) or proprietary PoE protocol are used?","netPoeProtocol","text",null,null,null,null,null,{"$f":"IF(ISBLANK(M49),\"\",M49)","v":""},{"$f":"IF(IF(ISNA(INDEX('Application V2'!A:M, MATCH(Application.!A49,'Application V2'!A:A,0),12)), \"\", INDEX('Application V2'!A:M, MATCH(Application.!A49,'Application V2'!A:A,0),12))=0, \"\", IF(ISNA(INDEX('Application V2'!A:M, MATCH(Application.!A49,'Application V2'!A:A,0),12)), \"\", INDEX('Application V2'!A:M, MATCH(Application.!A49,'Application V2'!A:A,0),12)))","v":""},null,null,null,null,null,null,null,"netPoeProtocol"]
[43,50,null,"i ","   "," e",null,"What is the recommended wire type and size for the system? ","netPoeWire","text",null,null,null,null,null,{"$f":"IF(ISBLANK(M50),\"\",M50)","v":""},{"$f":"IF(IF(ISNA(INDEX('Application V2'!A:M, MATCH(Application.!A50,'Application V2'!A:A,0),12)), \"\", INDEX('Application V2'!A:M, MATCH(Application.!A50,'Application V2'!A:A,0),12))=0, \"\", IF(ISNA(INDEX('Application V2'!A:M, MATCH(Application.!A50,'Application V2'!A:A,0),12)), \"\", INDEX('Application V2'!A:M, MATCH(Application.!A50,'Application V2'!A:A,0),12)))","v":""},null,null,null,null,null,null,null,"netPoeWire"]
[44,51,null,"i ","   "," e",null,"For the recommended PoE switch/power supply(s), does the specification sheet provide a  load curve (load vs. efficiency)?","netPoeLoadCurve","boolean",null,null,null,null,false,{"$f":"IF(O51=TRUE,\"Yes\", \"No\")","v":"No"},{"$f":"IF(IF(ISNA(INDEX('Application V2'!A:M, MATCH(Application.!A51,'Application V2'!A:A,0),12)), \"\", INDEX('Application V2'!A:M, MATCH(Application.!A51,'Application V2'!A:A,0),12))=0, \"\", IF(ISNA(INDEX('Application V2'!A:M, MATCH(Application.!A51,'Application V2'!A:A,0),12)), \"\", INDEX('Application V2'!A:M, MATCH(Application.!A51,'Application V2'!A:A,0),12)))","v":""},null,null,null,null,null,null,null,"netPoeLoadCurve"]
[45,52,null,"i ","   "," e","Does the system power luminaires with Direct Current (DC), not including PoE?",null,"netDc","boolean",null,null,null,null,false,{"$f":"IF(O52=TRUE,\"Yes\", \"No\")","v":"No"},{"$f":"IF(IF(ISNA(INDEX('Application V2'!A:M, MATCH(Application.!A52,'Application V2'!A:A,0),12)), \"\", INDEX('Application V2'!A:M, MATCH(Application.!A52,'Application V2'!A:A,0),12))=0, \"\", IF(ISNA(INDEX('Application V2'!A:M, MATCH(Application.!A52,'Application V2'!A:A,0),12)), \"\", INDEX('Application V2'!A:M, MATCH(Application.!A52,'Application V2'!A:A,0),12)))","v":""},null,null,null,null,null,null,null,"netDc"]
[46,53,null,"i ","   "," e",null,"What is the nominal voltage of the DC power that is output by the system to power luminaires (not including potential voltage drop from line losses) (integer)","netDcVoltage","integer",null,null,null,null,null,{"$f":"IF(ISBLANK(M53),\"\",M53)","v":""},{"$f":"IF(IF(ISNA(INDEX('Application V2'!A:M, MATCH(Application.!A53,'Application V2'!A:A,0),12)), \"\", INDEX('Application V2'!A:M, MATCH(Application.!A53,'Application V2'!A:A,0),12))=0, \"\", IF(ISNA(INDEX('Application V2'!A:M, MATCH(Application.!A53,'Application V2'!A:A,0),12)), \"\", INDEX('Application V2'!A:M, MATCH(Application.!A53,'Application V2'!A:A,0),12)))","v":""},null,null,null,null,null,null,null,"netDcVoltage"]
[47,54,null,"i",null,"e",null,"If the voltage is a range rather a single integer, enter the range.","netDcVoltageText","text",null,null,null,null,null,{"$f":"IF(ISBLANK(M54),\"\",M54)","v":""},null,null,null,null,null,null,null,null,"netDcVoltageText"]
[48,55,null,"i ","   "," e",null,"What is the recommended wire type and size for the system? ","netDcWire","text",null,null,null,null,null,"",{"$f":"IF(IF(ISNA(INDEX('Application V2'!A:M, MATCH(Application.!A55,'Application V2'!A:A,0),12)), \"\", INDEX('Application V2'!A:M, MATCH(Application.!A55,'Application V2'!A:A,0),12))=0, \"\", IF(ISNA(INDEX('Application V2'!A:M, MATCH(Application.!A55,'Application V2'!A:A,0),12)), \"\", INDEX('Application V2'!A:M, MATCH(Application.!A55,'Application V2'!A:A,0),12)))","v":""},null,null,null,null,null,null,null,"netDcWire"]
[49,56,null,"i ","   "," e",null,"For the recommended DC switch/power supply(s), does the specification sheet provide a  load curve (load vs. efficiency)?","netDcLoadCurve","boolean",null,null,null,null,false,{"$f":"IF(O56=TRUE,\"Yes\", \"No\")","v":"No"},{"$f":"IF(IF(ISNA(INDEX('Application V2'!A:M, MATCH(Application.!A56,'Application V2'!A:A,0),12)), \"\", INDEX('Application V2'!A:M, MATCH(Application.!A56,'Application V2'!A:A,0),12))=0, \"\", IF(ISNA(INDEX('Application V2'!A:M, MATCH(Application.!A56,'Application V2'!A:A,0),12)), \"\", INDEX('Application V2'!A:M, MATCH(Application.!A56,'Application V2'!A:A,0),12)))","v":""},null,null,null,null,null,null,null,"netDcLoadCurve"]
[50,57,null,"i ","   "," e","Does the system use a gateway or bridge?",null,"netGatewayBridge","boolean",null,null,null,null,false,{"$f":"IF(O57=TRUE,\"Yes\", \"No\")","v":"No"},{"$f":"IF(IF(ISNA(INDEX('Application V2'!A:M, MATCH(Application.!A57,'Application V2'!A:A,0),12)), \"\", INDEX('Application V2'!A:M, MATCH(Application.!A57,'Application V2'!A:A,0),12))=0, \"\", IF(ISNA(INDEX('Application V2'!A:M, MATCH(Application.!A57,'Application V2'!A:A,0),12)), \"\", INDEX('Application V2'!A:M, MATCH(Application.!A57,'Application V2'!A:A,0),12)))","v":""},null,null,null,null,null,null,null,"netGatewayBridge"]
[51,58,null,"i ","   "," e",null,"If edge devices communicate with a server, either local or cloud, through a gateway or bridge, how is the gateway/bridge connected to the server?","netGatewayConcat","concat 59:62",null,null,null,null,null,null,{"$f":"IF(IF(ISNA(INDEX('Application V2'!A:M, MATCH(Application.!A58,'Application V2'!A:A,0),12)), \"\", INDEX('Application V2'!A:M, MATCH(Application.!A58,'Application V2'!A:A,0),12))=0, \"\", IF(ISNA(INDEX('Application V2'!A:M, MATCH(Application.!A58,'Application V2'!A:A,0),12)), \"\", INDEX('Application V2'!A:M, MATCH(Application.!A58,'Application V2'!A:A,0),12)))","v":""},null,null,null,null,null,null,null,"netGatewayConcat"]
[52,59,null,"i ","   "," e",null,"Ethernet","netGatewayEthernet","boolean",null,null,null,null,false,{"$f":"IF(O59=TRUE,\"Yes\", \"No\")","v":"No"},{"$f":"IF(IF(ISNA(INDEX('Application V2'!A:M, MATCH(Application.!A59,'Application V2'!A:A,0),12)), \"\", INDEX('Application V2'!A:M, MATCH(Application.!A59,'Application V2'!A:A,0),12))=0, \"\", IF(ISNA(INDEX('Application V2'!A:M, MATCH(Application.!A59,'Application V2'!A:A,0),12)), \"\", INDEX('Application V2'!A:M, MATCH(Application.!A59,'Application V2'!A:A,0),12)))","v":""},null,null,null,null,null,null,null,"netGatewayEthernet"]
[53,60,null,"i ","   "," e",null,"Cellular","netGatewayCellular","boolean",null,null,null,null,false,{"$f":"IF(O60=TRUE,\"Yes\", \"No\")","v":"No"},{"$f":"IF(IF(ISNA(INDEX('Application V2'!A:M, MATCH(Application.!A60,'Application V2'!A:A,0),12)), \"\", INDEX('Application V2'!A:M, MATCH(Application.!A60,'Application V2'!A:A,0),12))=0, \"\", IF(ISNA(INDEX('Application V2'!A:M, MATCH(Application.!A60,'Application V2'!A:A,0),12)), \"\", INDEX('Application V2'!A:M, MATCH(Application.!A60,'Application V2'!A:A,0),12)))","v":""},null,null,null,null,null,null,null,"netGatewayCellular"]
[53.1,61,null,"i ","   "," e",null,"WiFi","netGatewayWiFi","boolean",null,null,null,null,false,"No"]
[54,62,null,"i ","   "," e",null,"Other (explain)","netGatewayOtherText","boolean",null,null,null,null,{"$f":"M62","v":0},{"$f":"IF(ISBLANK(M62),\"\",M62)","v":""},{"$f":"IF(IF(ISNA(INDEX('Application V2'!A:M, MATCH(Application.!A62,'Application V2'!A:A,0),12)), \"\", INDEX('Application V2'!A:M, MATCH(Application.!A62,'Application V2'!A:A,0),12))=0, \"\", IF(ISNA(INDEX('Application V2'!A:M, MATCH(Application.!A62,'Application V2'!A:A,0),12)), \"\", INDEX('Application V2'!A:M, MATCH(Application.!A62,'Application V2'!A:A,0),12)))","v":""},null,null,null,null,null,null,null,"netGatewayOtherText"]
[55,63,"I ","  ","E","   ","1)","Networking of Luminaires and Devices","blank",null,null,null,null,null,null,null,{"$f":"IF(IF(ISNA(INDEX('Application V2'!A:M, MATCH(Application.!A63,'Application V2'!A:A,0),12)), \"\", INDEX('Application V2'!A:M, MATCH(Application.!A63,'Application V2'!A:A,0),12))=0, \"\", IF(ISNA(INDEX('Application V2'!A:M, MATCH(Application.!A63,'Application V2'!A:A,0),12)), \"\", INDEX('Application V2'!A:M, MATCH(Application.!A63,'Application V2'!A:A,0),12)))","v":""},null,null,null,null,null,null,null,"blank"]
[56,64,"I ","  ","E","   ","2)","Occupancy Sensing","blank",null,null,null,null,null,null,null,{"$f":"IF(IF(ISNA(INDEX('Application V2'!A:M, MATCH(Application.!A64,'Application V2'!A:A,0),12)), \"\", INDEX('Application V2'!A:M, MATCH(Application.!A64,'Application V2'!A:A,0),12))=0, \"\", IF(ISNA(INDEX('Application V2'!A:M, MATCH(Application.!A64,'Application V2'!A:A,0),12)), \"\", INDEX('Application V2'!A:M, MATCH(Application.!A64,'Application V2'!A:A,0),12)))","v":""},null,null,null,null,null,null,null,"blank"]
[57,65,"  \n \n \n\n","  \n \n \n\n","  \n \n \n\n","  \n \n \n\n","Definition:  The capability to affect the operation of lighting equipment based upon detecting the presence or absence of people in a space or exterior environment.\nExterior systems must include either Occupancy Sensing or Traffic Sensing.  They may include both, but that is not required.",null,"blank",null,null,null,null,null,null,null,{"$f":"IF(IF(ISNA(INDEX('Application V2'!A:M, MATCH(Application.!A65,'Application V2'!A:A,0),12)), \"\", INDEX('Application V2'!A:M, MATCH(Application.!A65,'Application V2'!A:A,0),12))=0, \"\", IF(ISNA(INDEX('Application V2'!A:M, MATCH(Application.!A65,'Application V2'!A:A,0),12)), \"\", INDEX('Application V2'!A:M, MATCH(Application.!A65,'Application V2'!A:A,0),12)))","v":""},null,null,null,null,null,null,null,"blank"]
[58,66,"I ","  ","E","   ","Does the system have occupancy sensing capability, with instructions for how to configure and/or use this feature?",null,"hasOccupancy","boolean",null,null,null,null,false,{"$f":"IF(O66=TRUE,\"Yes\", \"No\")","v":"No"},{"$f":"IF(IF(ISNA(INDEX('Application V2'!A:M, MATCH(Application.!A66,'Application V2'!A:A,0),12)), \"\", INDEX('Application V2'!A:M, MATCH(Application.!A66,'Application V2'!A:A,0),12))=0, \"\", IF(ISNA(INDEX('Application V2'!A:M, MATCH(Application.!A66,'Application V2'!A:A,0),12)), \"\", INDEX('Application V2'!A:M, MATCH(Application.!A66,'Application V2'!A:A,0),12)))","v":""},null,null,null,null,null,null,null,"hasOccupancy"]
[59,67,null,"i",null,"e","Does the system have a vacancy mode option? (manual on, automatic off) ",null,"occVacancy","boolean",null,null,null,null,false,{"$f":"IF(O67=TRUE,\"Yes\", \"No\")","v":"No"},{"$f":"IF(IF(ISNA(INDEX('Application V2'!A:M, MATCH(Application.!A67,'Application V2'!A:A,0),12)), \"\", INDEX('Application V2'!A:M, MATCH(Application.!A67,'Application V2'!A:A,0),12))=0, \"\", IF(ISNA(INDEX('Application V2'!A:M, MATCH(Application.!A67,'Application V2'!A:A,0),12)), \"\", INDEX('Application V2'!A:M, MATCH(Application.!A67,'Application V2'!A:A,0),12)))","v":""},null,null,null,null,null,null,null,"occVacancy"]
[60,68,"  ","i ","   "," e","What mode(s) of detection are offered in single mode? ",null,"occSingleConcat","concat 69:74",null,null,"Choose all that apply.",null,null,null,{"$f":"IF(IF(ISNA(INDEX('Application V2'!A:M, MATCH(Application.!A68,'Application V2'!A:A,0),12)), \"\", INDEX('Application V2'!A:M, MATCH(Application.!A68,'Application V2'!A:A,0),12))=0, \"\", IF(ISNA(INDEX('Application V2'!A:M, MATCH(Application.!A68,'Application V2'!A:A,0),12)), \"\", INDEX('Application V2'!A:M, MATCH(Application.!A68,'Application V2'!A:A,0),12)))","v":""},null,null,null,null,null,null,null,"occSingleConcat"]
[61,69,"  ","i ","   "," e",null,"Microphonic","occSingleMicrophonic","boolean",null,null,null,null,false,{"$f":"IF(O69=TRUE,\"Yes\", \"No\")","v":"No"},{"$f":"IF(IF(ISNA(INDEX('Application V2'!A:M, MATCH(Application.!A69,'Application V2'!A:A,0),12)), \"\", INDEX('Application V2'!A:M, MATCH(Application.!A69,'Application V2'!A:A,0),12))=0, \"\", IF(ISNA(INDEX('Application V2'!A:M, MATCH(Application.!A69,'Application V2'!A:A,0),12)), \"\", INDEX('Application V2'!A:M, MATCH(Application.!A69,'Application V2'!A:A,0),12)))","v":""},null,null,null,null,null,null,null,"occSingleMicrophonic"]
[62,70,"  ","i ","   "," e",null,"Microwave","occSingleMicrowave","boolean",null,null,null,null,false,"No",{"$f":"IF(IF(ISNA(INDEX('Application V2'!A:M, MATCH(Application.!A70,'Application V2'!A:A,0),12)), \"\", INDEX('Application V2'!A:M, MATCH(Application.!A70,'Application V2'!A:A,0),12))=0, \"\", IF(ISNA(INDEX('Application V2'!A:M, MATCH(Application.!A70,'Application V2'!A:A,0),12)), \"\", INDEX('Application V2'!A:M, MATCH(Application.!A70,'Application V2'!A:A,0),12)))","v":""},null,null,null,null,null,null,null,"occSingleMicrowave"]
[63,71,"  ","i ","   "," e",null,"Optical","occSingleOptical","boolean",null,null,null,null,false,"No",{"$f":"IF(IF(ISNA(INDEX('Application V2'!A:M, MATCH(Application.!A71,'Application V2'!A:A,0),12)), \"\", INDEX('Application V2'!A:M, MATCH(Application.!A71,'Application V2'!A:A,0),12))=0, \"\", IF(ISNA(INDEX('Application V2'!A:M, MATCH(Application.!A71,'Application V2'!A:A,0),12)), \"\", INDEX('Application V2'!A:M, MATCH(Application.!A71,'Application V2'!A:A,0),12)))","v":""},null,null,null,null,null,null,null,"occSingleOptical"]
[64,72,"  ","i ","   "," e",null,"PIR","occSinglePIR","boolean",null,null,null,null,false,"No",{"$f":"IF(IF(ISNA(INDEX('Application V2'!A:M, MATCH(Application.!A72,'Application V2'!A:A,0),12)), \"\", INDEX('Application V2'!A:M, MATCH(Application.!A72,'Application V2'!A:A,0),12))=0, \"\", IF(ISNA(INDEX('Application V2'!A:M, MATCH(Application.!A72,'Application V2'!A:A,0),12)), \"\", INDEX('Application V2'!A:M, MATCH(Application.!A72,'Application V2'!A:A,0),12)))","v":""},null,null,null,null,null,null,null,"occSinglePIR"]
[66,73,"  ","i ","   "," e",null,"Ultrasonic","occSingleUltrasonic","boolean",null,null,null,null,false,"No",{"$f":"IF(IF(ISNA(INDEX('Application V2'!A:M, MATCH(Application.!A73,'Application V2'!A:A,0),12)), \"\", INDEX('Application V2'!A:M, MATCH(Application.!A73,'Application V2'!A:A,0),12))=0, \"\", IF(ISNA(INDEX('Application V2'!A:M, MATCH(Application.!A73,'Application V2'!A:A,0),12)), \"\", INDEX('Application V2'!A:M, MATCH(Application.!A73,'Application V2'!A:A,0),12)))","v":""},null,null,null,null,null,null,null,"occSingleUltrasonic"]
[68,74,"  ","i ","   "," e",null,"Other (explain)","occSingleOther","text",null,null,null,null,null,{"$f":"IF(ISBLANK(M74),\"\",M74)","v":""},{"$f":"IF(IF(ISNA(INDEX('Application V2'!A:M, MATCH(Application.!A74,'Application V2'!A:A,0),12)), \"\", INDEX('Application V2'!A:M, MATCH(Application.!A74,'Application V2'!A:A,0),12))=0, \"\", IF(ISNA(INDEX('Application V2'!A:M, MATCH(Application.!A74,'Application V2'!A:A,0),12)), \"\", INDEX('Application V2'!A:M, MATCH(Application.!A74,'Application V2'!A:A,0),12)))","v":""},null,null,null,null,null,null,null,"occSingleOther"]
[69,75,"  ","i ","   "," e","What mode(s) of detection are offered in dual mode? ",null,"occDualConcat","concat 76:81",null,null,"Choose all that apply.",null,null,null,{"$f":"IF(IF(ISNA(INDEX('Application V2'!A:M, MATCH(Application.!A75,'Application V2'!A:A,0),12)), \"\", INDEX('Application V2'!A:M, MATCH(Application.!A75,'Application V2'!A:A,0),12))=0, \"\", IF(ISNA(INDEX('Application V2'!A:M, MATCH(Application.!A75,'Application V2'!A:A,0),12)), \"\", INDEX('Application V2'!A:M, MATCH(Application.!A75,'Application V2'!A:A,0),12)))","v":""},null,null,null,null,null,null,null,"occDualConcat"]
[70,76,"  ","i ","   "," e",null,"Microphonic","occDualMicrophonic","boolean",null,null,null,null,false,{"$f":"IF(O76=TRUE,\"Yes\", \"No\")","v":"No"},{"$f":"IF(IF(ISNA(INDEX('Application V2'!A:M, MATCH(Application.!A76,'Application V2'!A:A,0),12)), \"\", INDEX('Application V2'!A:M, MATCH(Application.!A76,'Application V2'!A:A,0),12))=0, \"\", IF(ISNA(INDEX('Application V2'!A:M, MATCH(Application.!A76,'Application V2'!A:A,0),12)), \"\", INDEX('Application V2'!A:M, MATCH(Application.!A76,'Application V2'!A:A,0),12)))","v":""},null,null,null,null,null,null,null,"occDualMicrophonic"]
[71,77,"  ","i ","   "," e",null,"Microwave","occDualMicrowave","boolean",null,null,null,null,false,"No",{"$f":"IF(IF(ISNA(INDEX('Application V2'!A:M, MATCH(Application.!A77,'Application V2'!A:A,0),12)), \"\", INDEX('Application V2'!A:M, MATCH(Application.!A77,'Application V2'!A:A,0),12))=0, \"\", IF(ISNA(INDEX('Application V2'!A:M, MATCH(Application.!A77,'Application V2'!A:A,0),12)), \"\", INDEX('Application V2'!A:M, MATCH(Application.!A77,'Application V2'!A:A,0),12)))","v":""},null,null,null,null,null,null,null,"occDualMicrowave"]
[72,78,"  ","i ","   "," e",null,"Optical","occDualOptical","boolean",null,null,null,null,false,"No",{"$f":"IF(IF(ISNA(INDEX('Application V2'!A:M, MATCH(Application.!A78,'Application V2'!A:A,0),12)), \"\", INDEX('Application V2'!A:M, MATCH(Application.!A78,'Application V2'!A:A,0),12))=0, \"\", IF(ISNA(INDEX('Application V2'!A:M, MATCH(Application.!A78,'Application V2'!A:A,0),12)), \"\", INDEX('Application V2'!A:M, MATCH(Application.!A78,'Application V2'!A:A,0),12)))","v":""},null,null,null,null,null,null,null,"occDualOptical"]
[73,79,"  ","i ","   "," e",null,"PIR","occDualPIR","boolean",null,null,null,null,false,"No",{"$f":"IF(IF(ISNA(INDEX('Application V2'!A:M, MATCH(Application.!A79,'Application V2'!A:A,0),12)), \"\", INDEX('Application V2'!A:M, MATCH(Application.!A79,'Application V2'!A:A,0),12))=0, \"\", IF(ISNA(INDEX('Application V2'!A:M, MATCH(Application.!A79,'Application V2'!A:A,0),12)), \"\", INDEX('Application V2'!A:M, MATCH(Application.!A79,'Application V2'!A:A,0),12)))","v":""},null,null,null,null,null,null,null,"occDualPIR"]
[75,80,"  ","i ","   "," e",null,"Ultrasonic","occDualUltrasonic","boolean",null,null,null,null,false,"No",{"$f":"IF(IF(ISNA(INDEX('Application V2'!A:M, MATCH(Application.!A80,'Application V2'!A:A,0),12)), \"\", INDEX('Application V2'!A:M, MATCH(Application.!A80,'Application V2'!A:A,0),12))=0, \"\", IF(ISNA(INDEX('Application V2'!A:M, MATCH(Application.!A80,'Application V2'!A:A,0),12)), \"\", INDEX('Application V2'!A:M, MATCH(Application.!A80,'Application V2'!A:A,0),12)))","v":""},null,null,null,null,null,null,null,"occDualUltrasonic"]
[77,81,"  ","i ","   "," e",null,"Other (explain)","occDualOther","text",null,null,null,null,null,{"$f":"IF(ISBLANK(M81),\"\",M81)","v":""},{"$f":"IF(IF(ISNA(INDEX('Application V2'!A:M, MATCH(Application.!A81,'Application V2'!A:A,0),12)), \"\", INDEX('Application V2'!A:M, MATCH(Application.!A81,'Application V2'!A:A,0),12))=0, \"\", IF(ISNA(INDEX('Application V2'!A:M, MATCH(Application.!A81,'Application V2'!A:A,0),12)), \"\", INDEX('Application V2'!A:M, MATCH(Application.!A81,'Application V2'!A:A,0),12)))","v":""},null,null,null,null,null,null,null,"occDualOther"]
[78,82," ","\n i",null," e","For PIR sensors, what coverage options are offered, as defined in NEMA WD7-2011, for standard height?",null,"occLowbayConcat","concat 83:87",null,null,"Choose all that apply.",null,null,null,{"$f":"IF(IF(ISNA(INDEX('Application V2'!A:M, MATCH(Application.!A82,'Application V2'!A:A,0),12)), \"\", INDEX('Application V2'!A:M, MATCH(Application.!A82,'Application V2'!A:A,0),12))=0, \"\", IF(ISNA(INDEX('Application V2'!A:M, MATCH(Application.!A82,'Application V2'!A:A,0),12)), \"\", INDEX('Application V2'!A:M, MATCH(Application.!A82,'Application V2'!A:A,0),12)))","v":""},null,null,null,null,null,null,null,"occLowbayConcat"]
[79,83," ","i",null," e",null,"Ceiling","occLowbayCeiling","boolean",null,null,null,null,false,{"$f":"IF(O83=TRUE,\"Yes\", \"No\")","v":"No"},{"$f":"IF(IF(ISNA(INDEX('Application V2'!A:M, MATCH(Application.!A83,'Application V2'!A:A,0),12)), \"\", INDEX('Application V2'!A:M, MATCH(Application.!A83,'Application V2'!A:A,0),12))=0, \"\", IF(ISNA(INDEX('Application V2'!A:M, MATCH(Application.!A83,'Application V2'!A:A,0),12)), \"\", INDEX('Application V2'!A:M, MATCH(Application.!A83,'Application V2'!A:A,0),12)))","v":""},null,null,null,null,null,null,null,"occLowbayCeiling"]
[80,84," ","i",null," e",null,"Corner","occLowbayCorner","boolean",null,null,null,null,false,{"$f":"IF(O84=TRUE,\"Yes\", \"No\")","v":"No"},{"$f":"IF(IF(ISNA(INDEX('Application V2'!A:M, MATCH(Application.!A84,'Application V2'!A:A,0),12)), \"\", INDEX('Application V2'!A:M, MATCH(Application.!A84,'Application V2'!A:A,0),12))=0, \"\", IF(ISNA(INDEX('Application V2'!A:M, MATCH(Application.!A84,'Application V2'!A:A,0),12)), \"\", INDEX('Application V2'!A:M, MATCH(Application.!A84,'Application V2'!A:A,0),12)))","v":""},null,null,null,null,null,null,null,"occLowbayCorner"]
[81,85," ","i",null," e",null,"Corridor","occLowbayCorridor","boolean",null,null,null,null,false,{"$f":"IF(O85=TRUE,\"Yes\", \"No\")","v":"No"},{"$f":"IF(IF(ISNA(INDEX('Application V2'!A:M, MATCH(Application.!A85,'Application V2'!A:A,0),12)), \"\", INDEX('Application V2'!A:M, MATCH(Application.!A85,'Application V2'!A:A,0),12))=0, \"\", IF(ISNA(INDEX('Application V2'!A:M, MATCH(Application.!A85,'Application V2'!A:A,0),12)), \"\", INDEX('Application V2'!A:M, MATCH(Application.!A85,'Application V2'!A:A,0),12)))","v":""},null,null,null,null,null,null,null,"occLowbayCorridor"]
[82,86," ","i",null," e",null,"Wall  ","occLowbayWall  ","boolean",null,null,null,null,false,{"$f":"IF(O86=TRUE,\"Yes\", \"No\")","v":"No"},{"$f":"IF(IF(ISNA(INDEX('Application V2'!A:M, MATCH(Application.!A86,'Application V2'!A:A,0),12)), \"\", INDEX('Application V2'!A:M, MATCH(Application.!A86,'Application V2'!A:A,0),12))=0, \"\", IF(ISNA(INDEX('Application V2'!A:M, MATCH(Application.!A86,'Application V2'!A:A,0),12)), \"\", INDEX('Application V2'!A:M, MATCH(Application.!A86,'Application V2'!A:A,0),12)))","v":""},null,null,null,null,null,null,null,"occLowbayWall  "]
[83,87," ","i",null," e",null,"Other (explain)","occLowbayOther ","text",null,null,null,null,null,{"$f":"IF(ISBLANK(M87),\"\",M87)","v":""},{"$f":"IF(IF(ISNA(INDEX('Application V2'!A:M, MATCH(Application.!A87,'Application V2'!A:A,0),12)), \"\", INDEX('Application V2'!A:M, MATCH(Application.!A87,'Application V2'!A:A,0),12))=0, \"\", IF(ISNA(INDEX('Application V2'!A:M, MATCH(Application.!A87,'Application V2'!A:A,0),12)), \"\", INDEX('Application V2'!A:M, MATCH(Application.!A87,'Application V2'!A:A,0),12)))","v":""},null,null,null,null,null,null,null,"occLowbayOther "]
[84,88," ","\n i",null," e","For PIR sensors, what coverage options are offered, as defined in NEMA WD7-2011, for high-bay height (\"tested at one or more of the following mounting heights of 20ft, 30ft, 40ft, 50ft & 60ft.”) ?",null,"occHighbayConcat","concat 89:93",null,null,"Choose all that apply.",null,null,null,{"$f":"IF(IF(ISNA(INDEX('Application V2'!A:M, MATCH(Application.!A88,'Application V2'!A:A,0),12)), \"\", INDEX('Application V2'!A:M, MATCH(Application.!A88,'Application V2'!A:A,0),12))=0, \"\", IF(ISNA(INDEX('Application V2'!A:M, MATCH(Application.!A88,'Application V2'!A:A,0),12)), \"\", INDEX('Application V2'!A:M, MATCH(Application.!A88,'Application V2'!A:A,0),12)))","v":""},null,null,null,null,null,null,null,"occHighbayConcat"]
[85,89," ","i",null," e",null,"Ceiling","occHighbayCeiling","boolean",null,null,null,null,false,{"$f":"IF(O89=TRUE,\"Yes\", \"No\")","v":"No"},{"$f":"IF(IF(ISNA(INDEX('Application V2'!A:M, MATCH(Application.!A89,'Application V2'!A:A,0),12)), \"\", INDEX('Application V2'!A:M, MATCH(Application.!A89,'Application V2'!A:A,0),12))=0, \"\", IF(ISNA(INDEX('Application V2'!A:M, MATCH(Application.!A89,'Application V2'!A:A,0),12)), \"\", INDEX('Application V2'!A:M, MATCH(Application.!A89,'Application V2'!A:A,0),12)))","v":""},null,null,null,null,null,null,null,"occHighbayCeiling"]
[86,90," ","i",null," e",null,"Corner","occHighbayCorner","boolean",null,null,null,null,false,{"$f":"IF(O90=TRUE,\"Yes\", \"No\")","v":"No"},{"$f":"IF(IF(ISNA(INDEX('Application V2'!A:M, MATCH(Application.!A90,'Application V2'!A:A,0),12)), \"\", INDEX('Application V2'!A:M, MATCH(Application.!A90,'Application V2'!A:A,0),12))=0, \"\", IF(ISNA(INDEX('Application V2'!A:M, MATCH(Application.!A90,'Application V2'!A:A,0),12)), \"\", INDEX('Application V2'!A:M, MATCH(Application.!A90,'Application V2'!A:A,0),12)))","v":""},null,null,null,null,null,null,null,"occHighbayCorner"]
[87,91," ","i",null," e",null,"Corridor","occHighbayCorridor","boolean",null,null,null,null,false,{"$f":"IF(O91=TRUE,\"Yes\", \"No\")","v":"No"},{"$f":"IF(IF(ISNA(INDEX('Application V2'!A:M, MATCH(Application.!A91,'Application V2'!A:A,0),12)), \"\", INDEX('Application V2'!A:M, MATCH(Application.!A91,'Application V2'!A:A,0),12))=0, \"\", IF(ISNA(INDEX('Application V2'!A:M, MATCH(Application.!A91,'Application V2'!A:A,0),12)), \"\", INDEX('Application V2'!A:M, MATCH(Application.!A91,'Application V2'!A:A,0),12)))","v":""},null,null,null,null,null,null,null,"occHighbayCorridor"]
[88,92," ","i",null," e",null,"Wall  ","occHighbayWall  ","boolean",null,null,null,null,false,{"$f":"IF(O92=TRUE,\"Yes\", \"No\")","v":"No"},{"$f":"IF(IF(ISNA(INDEX('Application V2'!A:M, MATCH(Application.!A92,'Application V2'!A:A,0),12)), \"\", INDEX('Application V2'!A:M, MATCH(Application.!A92,'Application V2'!A:A,0),12))=0, \"\", IF(ISNA(INDEX('Application V2'!A:M, MATCH(Application.!A92,'Application V2'!A:A,0),12)), \"\", INDEX('Application V2'!A:M, MATCH(Application.!A92,'Application V2'!A:A,0),12)))","v":""},null,null,null,null,null,null,null,"occHighbayWall  "]
[89,93," ","i",null," e",null,"Other (explain)","occHighbayOther","text",null,null,null,null,null,{"$f":"IF(ISBLANK(M93),\"\",M93)","v":""},{"$f":"IF(IF(ISNA(INDEX('Application V2'!A:M, MATCH(Application.!A93,'Application V2'!A:A,0),12)), \"\", INDEX('Application V2'!A:M, MATCH(Application.!A93,'Application V2'!A:A,0),12))=0, \"\", IF(ISNA(INDEX('Application V2'!A:M, MATCH(Application.!A93,'Application V2'!A:A,0),12)), \"\", INDEX('Application V2'!A:M, MATCH(Application.!A93,'Application V2'!A:A,0),12)))","v":""},null,null,null,null,null,null,null,"occHighbayOther"]
[90,94,"  ","i ","   "," e","What is the default time delay setting in minutes?",null,"occDefaultDelayMinutes","real xx.x",null,null,null,null,null,{"$f":"IF(ISBLANK(M94),\"\",M94)","v":""},{"$f":"IF(IF(ISNA(INDEX('Application V2'!A:M, MATCH(Application.!A94,'Application V2'!A:A,0),12)), \"\", INDEX('Application V2'!A:M, MATCH(Application.!A94,'Application V2'!A:A,0),12))=0, \"\", IF(ISNA(INDEX('Application V2'!A:M, MATCH(Application.!A94,'Application V2'!A:A,0),12)), \"\", INDEX('Application V2'!A:M, MATCH(Application.!A94,'Application V2'!A:A,0),12)))","v":""},null,null,null,null,null,null,null,"occDefaultDelayMinutes"]
[91,95,null,"i ","  "," e","Is time delay field adjustable?  If yes, include a reference describing how",null,"occDelayAdjustable","boolean",null,null,null,null,false,{"$f":"IF(O95=TRUE,\"Yes\", \"No\")","v":"No"},{"$f":"IF(IF(ISNA(INDEX('Application V2'!A:M, MATCH(Application.!A95,'Application V2'!A:A,0),12)), \"\", INDEX('Application V2'!A:M, MATCH(Application.!A95,'Application V2'!A:A,0),12))=0, \"\", IF(ISNA(INDEX('Application V2'!A:M, MATCH(Application.!A95,'Application V2'!A:A,0),12)), \"\", INDEX('Application V2'!A:M, MATCH(Application.!A95,'Application V2'!A:A,0),12)))","v":""},null,null,null,null,null,null,null,"occDelayAdjustable"]
[92,96,"  ","i ","   "," e","Is a damp-condition occupancy sensor(s) available?",null,"occDamp","boolean",null,null,null,null,false,{"$f":"IF(O96=TRUE,\"Yes\", \"No\")","v":"No"},{"$f":"IF(IF(ISNA(INDEX('Application V2'!A:M, MATCH(Application.!A96,'Application V2'!A:A,0),12)), \"\", INDEX('Application V2'!A:M, MATCH(Application.!A96,'Application V2'!A:A,0),12))=0, \"\", IF(ISNA(INDEX('Application V2'!A:M, MATCH(Application.!A96,'Application V2'!A:A,0),12)), \"\", INDEX('Application V2'!A:M, MATCH(Application.!A96,'Application V2'!A:A,0),12)))","v":""},null,null,null,null,null,null,null,"occDamp"]
[93,97,null,null,null,null,null,"If so, describe, for instance \"IP67 ceiling mount\"","occDampText","text",null,null,null,null,null,{"$f":"IF(ISBLANK(M97),\"\",M97)","v":""},{"$f":"IF(IF(ISNA(INDEX('Application V2'!A:M, MATCH(Application.!A97,'Application V2'!A:A,0),12)), \"\", INDEX('Application V2'!A:M, MATCH(Application.!A97,'Application V2'!A:A,0),12))=0, \"\", IF(ISNA(INDEX('Application V2'!A:M, MATCH(Application.!A97,'Application V2'!A:A,0),12)), \"\", INDEX('Application V2'!A:M, MATCH(Application.!A97,'Application V2'!A:A,0),12)))","v":""},null,null,null,null,null,null,null,"occDampText"]
[94,98,null,"i \n \n  "," "," e\n \n \n  ","Does the system have the ability to set a dim level rather than off when unoccupied? (e.g. can the lights be set to 30% dim level rather than off when no occupancy is detected?)  If yes, include a reference describing how",null,"occDimBesidesZero","boolean",null,null,null,null,false,{"$f":"IF(O98=TRUE,\"Yes\", \"No\")","v":"No"},{"$f":"IF(IF(ISNA(INDEX('Application V2'!A:M, MATCH(Application.!A98,'Application V2'!A:A,0),12)), \"\", INDEX('Application V2'!A:M, MATCH(Application.!A98,'Application V2'!A:A,0),12))=0, \"\", IF(ISNA(INDEX('Application V2'!A:M, MATCH(Application.!A98,'Application V2'!A:A,0),12)), \"\", INDEX('Application V2'!A:M, MATCH(Application.!A98,'Application V2'!A:A,0),12)))","v":""},null,null,null,null,null,null,null,"occDimBesidesZero"]
[95,99,"  \n ","i \n ","   \n "," e\n ",null,"If yes, is this unoccupied dim level adjustable?  If yes, include a reference describing how","occDimBesidesZeroAdjustable","boolean",null,null,null,null,false,{"$f":"IF(O99=TRUE,\"Yes\", \"No\")","v":"No"},{"$f":"IF(IF(ISNA(INDEX('Application V2'!A:M, MATCH(Application.!A99,'Application V2'!A:A,0),12)), \"\", INDEX('Application V2'!A:M, MATCH(Application.!A99,'Application V2'!A:A,0),12))=0, \"\", IF(ISNA(INDEX('Application V2'!A:M, MATCH(Application.!A99,'Application V2'!A:A,0),12)), \"\", INDEX('Application V2'!A:M, MATCH(Application.!A99,'Application V2'!A:A,0),12)))","v":""},null,null,null,null,null,null,null,"occDimBesidesZeroAdjustable"]
[95.1,100,null,"i",null,"e","Does the system share any presence data beyond simple occupancy?",null,"occPresenceConcat","concat 101:105",null,null,null,null,null,{"$f":"IF(O100=TRUE,\"Yes\", \"No\")","v":"No"}]
[95.2,101,null,"i",null,"e",null,"Density","occPresenceDensity","boolean",null,null,null,null,false,"No"]
[95.3,102,null,"i",null,"e",null,"Directionality","occPresenceDirectionality","boolean",null,null,null,null,false,"No"]
[95.4,103,null,"i",null,"e",null,"Distance","occPresenceDistance","boolean",null,null,null,null,false,"No"]
[95.6,104,null,"i",null,"e",null,"Duration","occPresenceDuration","boolean",null,null,null,null,false,"No"]
[95.7,105,null,"i",null,"e",null,"Other (explain)","occPresenceOther","text",null,null,null,null,null,{"$f":"IF(ISBLANK(M105),\"\",M105)","v":""}]
[96,106,"I ","  ","E","   ","2)","Occupancy Sensing","blank",null,null,null,null,null,null,null,{"$f":"IF(IF(ISNA(INDEX('Application V2'!A:M, MATCH(Application.!A106,'Application V2'!A:A,0),12)), \"\", INDEX('Application V2'!A:M, MATCH(Application.!A106,'Application V2'!A:A,0),12))=0, \"\", IF(ISNA(INDEX('Application V2'!A:M, MATCH(Application.!A106,'Application V2'!A:A,0),12)), \"\", INDEX('Application V2'!A:M, MATCH(Application.!A106,'Application V2'!A:A,0),12)))","v":""},null,null,null,null,null,null,null,"blank"]
[97,107,null,null,"E",null,"3)","Traffic Sensing","blank",null,null,null,null,null,null,null,{"$f":"IF(IF(ISNA(INDEX('Application V2'!A:M, MATCH(Application.!A107,'Application V2'!A:A,0),12)), \"\", INDEX('Application V2'!A:M, MATCH(Application.!A107,'Application V2'!A:A,0),12))=0, \"\", IF(ISNA(INDEX('Application V2'!A:M, MATCH(Application.!A107,'Application V2'!A:A,0),12)), \"\", INDEX('Application V2'!A:M, MATCH(Application.!A107,'Application V2'!A:A,0),12)))","v":""},null,null,null,null,null,null,null,"blank"]
[98,108," ","  \n \n","  .\n \n \n \n \n \n"," \n  \n \n \n\n \n \n\n \n ","Definition:  The capability to affect the operation of lighting or other equipment based upon detecting the presence or absence of moving vehicles in an area.\n\nSystems may satisfy this requirement through External Systems Integration as described below in lieu of in-system sensors if another source of data is used for presence or absence detection.\n\nExterior systems must include either Occupancy Sensing or Traffic Sensing.  They may include both, but that is not required.",null,"blank",null,null,null,null,null,null,null,{"$f":"IF(IF(ISNA(INDEX('Application V2'!A:M, MATCH(Application.!A108,'Application V2'!A:A,0),12)), \"\", INDEX('Application V2'!A:M, MATCH(Application.!A108,'Application V2'!A:A,0),12))=0, \"\", IF(ISNA(INDEX('Application V2'!A:M, MATCH(Application.!A108,'Application V2'!A:A,0),12)), \"\", INDEX('Application V2'!A:M, MATCH(Application.!A108,'Application V2'!A:A,0),12)))","v":""},null,null,null,null,null,null,null,"blank"]
[99,109,null,null,"E\n .","   ","Does the system have sensing capability for moving vehicular traffic, with instructions for how to configure and/or use this feature?",null,"hasTraffic","boolean",null,null,null,null,false,{"$f":"IF(O109=TRUE,\"Yes\", \"No\")","v":"No"},{"$f":"IF(IF(ISNA(INDEX('Application V2'!A:M, MATCH(Application.!A109,'Application V2'!A:A,0),12)), \"\", INDEX('Application V2'!A:M, MATCH(Application.!A109,'Application V2'!A:A,0),12))=0, \"\", IF(ISNA(INDEX('Application V2'!A:M, MATCH(Application.!A109,'Application V2'!A:A,0),12)), \"\", INDEX('Application V2'!A:M, MATCH(Application.!A109,'Application V2'!A:A,0),12)))","v":""},null,null,null,null,null,null,null,"hasTraffic"]
[100,110,null,null,"   "," e","How does the system support sensing of vehicle traffic?",null,"trafficConcat 120:121","concat 111:113",null,null,"Select all that apply.",null,null,null,{"$f":"IF(IF(ISNA(INDEX('Application V2'!A:M, MATCH(Application.!A110,'Application V2'!A:A,0),12)), \"\", INDEX('Application V2'!A:M, MATCH(Application.!A110,'Application V2'!A:A,0),12))=0, \"\", IF(ISNA(INDEX('Application V2'!A:M, MATCH(Application.!A110,'Application V2'!A:A,0),12)), \"\", INDEX('Application V2'!A:M, MATCH(Application.!A110,'Application V2'!A:A,0),12)))","v":""},null,null,null,null,null,null,null,"trafficConcat 120:121"]
[101,111,null,null,null," e",null,"Sensors that detect moving vehicles","trafficOccSensing","boolean",null,null,null,null,false,{"$f":"IF(O111=TRUE,\"Yes\", \"No\")","v":"No"},{"$f":"IF(IF(ISNA(INDEX('Application V2'!A:M, MATCH(Application.!A111,'Application V2'!A:A,0),12)), \"\", INDEX('Application V2'!A:M, MATCH(Application.!A111,'Application V2'!A:A,0),12))=0, \"\", IF(ISNA(INDEX('Application V2'!A:M, MATCH(Application.!A111,'Application V2'!A:A,0),12)), \"\", INDEX('Application V2'!A:M, MATCH(Application.!A111,'Application V2'!A:A,0),12)))","v":""},null,null,null,null,null,null,null,"trafficOccSensing"]
[102,112,null,null,null," e",null,"External Systems Integration","trafficExternalData","boolean",null,null,null,null,false,{"$f":"IF(O112=TRUE,\"Yes\", \"No\")","v":"No"},{"$f":"IF(IF(ISNA(INDEX('Application V2'!A:M, MATCH(Application.!A112,'Application V2'!A:A,0),12)), \"\", INDEX('Application V2'!A:M, MATCH(Application.!A112,'Application V2'!A:A,0),12))=0, \"\", IF(ISNA(INDEX('Application V2'!A:M, MATCH(Application.!A112,'Application V2'!A:A,0),12)), \"\", INDEX('Application V2'!A:M, MATCH(Application.!A112,'Application V2'!A:A,0),12)))","v":""},null,null,null,null,null,null,null,"trafficExternalData"]
[103,113,null,null,null," e",null,"If External System Integration, describe briefly, e.g. \"Proximity data from cellular network thru API\"","trafficExternalDataText","text",null,null,null,null,null,{"$f":"IF(ISBLANK(M113),\"\",M113)","v":""},{"$f":"IF(IF(ISNA(INDEX('Application V2'!A:M, MATCH(Application.!A113,'Application V2'!A:A,0),12)), \"\", INDEX('Application V2'!A:M, MATCH(Application.!A113,'Application V2'!A:A,0),12))=0, \"\", IF(ISNA(INDEX('Application V2'!A:M, MATCH(Application.!A113,'Application V2'!A:A,0),12)), \"\", INDEX('Application V2'!A:M, MATCH(Application.!A113,'Application V2'!A:A,0),12)))","v":""},null,null,null,null,null,null,null,"trafficExternalDataText"]
[104,114,null,null,"E","   ","3)","Traffic Sensing","blank",null,null,null,null,null,null,null,{"$f":"IF(IF(ISNA(INDEX('Application V2'!A:M, MATCH(Application.!A114,'Application V2'!A:A,0),12)), \"\", INDEX('Application V2'!A:M, MATCH(Application.!A114,'Application V2'!A:A,0),12))=0, \"\", IF(ISNA(INDEX('Application V2'!A:M, MATCH(Application.!A114,'Application V2'!A:A,0),12)), \"\", INDEX('Application V2'!A:M, MATCH(Application.!A114,'Application V2'!A:A,0),12)))","v":""},null,null,null,null,null,null,null,"blank"]
[105,115,"I ","  ","E","   ","4)","Daylight Harvesting / Photocell Control","blank",null,null,null,null,null,null,null,{"$f":"IF(IF(ISNA(INDEX('Application V2'!A:M, MATCH(Application.!A115,'Application V2'!A:A,0),12)), \"\", INDEX('Application V2'!A:M, MATCH(Application.!A115,'Application V2'!A:A,0),12))=0, \"\", IF(ISNA(INDEX('Application V2'!A:M, MATCH(Application.!A115,'Application V2'!A:A,0),12)), \"\", INDEX('Application V2'!A:M, MATCH(Application.!A115,'Application V2'!A:A,0),12)))","v":""},null,null,null,null,null,null,null,"blank"]
[106,116," \n \n \n \n"," \n \n \n \n"," \n \n \n \n"," \n \n \n \n \n","Definition:  The capability to automatically affect the operation of lighting or other equipment based on the amount of daylight and/or ambient light that is present in a space, area,  or exterior environment.  This capability is typically called Daylight Harvesting for Interior systems, and Photocell Control for Exterior systems.",null,"blank",null,null,null,null,null,null,null,{"$f":"IF(IF(ISNA(INDEX('Application V2'!A:M, MATCH(Application.!A116,'Application V2'!A:A,0),12)), \"\", INDEX('Application V2'!A:M, MATCH(Application.!A116,'Application V2'!A:A,0),12))=0, \"\", IF(ISNA(INDEX('Application V2'!A:M, MATCH(Application.!A116,'Application V2'!A:A,0),12)), \"\", INDEX('Application V2'!A:M, MATCH(Application.!A116,'Application V2'!A:A,0),12)))","v":""},null,null,null,null,null,null,null,"blank"]
[107,117,"I \n .","  ","E\n .","   ","Does the system have Daylight Harvesting / Photocell Control capability, with instructions for how to configure and/or use this feature?",null,"hasDaylight","boolean",null,null,null,null,false,{"$f":"IF(O117=TRUE,\"Yes\", \"No\")","v":"No"},{"$f":"IF(IF(ISNA(INDEX('Application V2'!A:M, MATCH(Application.!A117,'Application V2'!A:A,0),12)), \"\", INDEX('Application V2'!A:M, MATCH(Application.!A117,'Application V2'!A:A,0),12))=0, \"\", IF(ISNA(INDEX('Application V2'!A:M, MATCH(Application.!A117,'Application V2'!A:A,0),12)), \"\", INDEX('Application V2'!A:M, MATCH(Application.!A117,'Application V2'!A:A,0),12)))","v":""},null,null,null,null,null,null,null,"hasDaylight"]
[108,118,"  \n \n ","i \n \n ","   \n \n ",null,"Does the system provide integration with shading systems? If yes, include a reference describing how this is accomplished. ",null,"daylightShading","boolean",null,null,null,null,false,{"$f":"IF(O118=TRUE,\"Yes\", \"No\")","v":"No"},{"$f":"IF(IF(ISNA(INDEX('Application V2'!A:M, MATCH(Application.!A118,'Application V2'!A:A,0),12)), \"\", INDEX('Application V2'!A:M, MATCH(Application.!A118,'Application V2'!A:A,0),12))=0, \"\", IF(ISNA(INDEX('Application V2'!A:M, MATCH(Application.!A118,'Application V2'!A:A,0),12)), \"\", INDEX('Application V2'!A:M, MATCH(Application.!A118,'Application V2'!A:A,0),12)))","v":""},null,null,null,null,null,null,null,"daylightShading"]
[109,119,"  ","i ","   ",null,null,"If yes, describe any additional components needed","daylightShadingComponents","text",null,null,null,null,null,{"$f":"IF(ISBLANK(M119),\"\",M119)","v":""},{"$f":"IF(IF(ISNA(INDEX('Application V2'!A:M, MATCH(Application.!A119,'Application V2'!A:A,0),12)), \"\", INDEX('Application V2'!A:M, MATCH(Application.!A119,'Application V2'!A:A,0),12))=0, \"\", IF(ISNA(INDEX('Application V2'!A:M, MATCH(Application.!A119,'Application V2'!A:A,0),12)), \"\", INDEX('Application V2'!A:M, MATCH(Application.!A119,'Application V2'!A:A,0),12)))","v":""},null,null,null,null,null,null,null,"daylightShadingComponents"]
[110,120,"  \n \n","i \n \n","   \n \n"," e\n \n","Can the response of the system to the data from the photosensor be adjusted? If yes, include a reference describing how this is accomplished. ",null,"daylightResponseAdjustable","boolean",null,null,null,null,false,{"$f":"IF(O120=TRUE,\"Yes\", \"No\")","v":"No"},{"$f":"IF(IF(ISNA(INDEX('Application V2'!A:M, MATCH(Application.!A120,'Application V2'!A:A,0),12)), \"\", INDEX('Application V2'!A:M, MATCH(Application.!A120,'Application V2'!A:A,0),12))=0, \"\", IF(ISNA(INDEX('Application V2'!A:M, MATCH(Application.!A120,'Application V2'!A:A,0),12)), \"\", INDEX('Application V2'!A:M, MATCH(Application.!A120,'Application V2'!A:A,0),12)))","v":""},null,null,null,null,null,null,null,"daylightResponseAdjustable"]
[111,121,"  \n \n","i \n \n","   \n \n"," e\n \n","Does the system have the capability to report photosensor settings (adjustable input parameters) in a user interface? ",null,"daylightSettingsUI","boolean",null,null,null,null,false,{"$f":"IF(O121=TRUE,\"Yes\", \"No\")","v":"No"},{"$f":"IF(IF(ISNA(INDEX('Application V2'!A:M, MATCH(Application.!A121,'Application V2'!A:A,0),12)), \"\", INDEX('Application V2'!A:M, MATCH(Application.!A121,'Application V2'!A:A,0),12))=0, \"\", IF(ISNA(INDEX('Application V2'!A:M, MATCH(Application.!A121,'Application V2'!A:A,0),12)), \"\", INDEX('Application V2'!A:M, MATCH(Application.!A121,'Application V2'!A:A,0),12)))","v":""},null,null,null,null,null,null,null,"daylightSettingsUI"]
[112,122,null,"i \n \n","   \n \n"," e\n \n","Is a damp-condition photosensor(s) available?",null,"daylightDamp","boolean",null,null,null,null,false,{"$f":"IF(O122=TRUE,\"Yes\", \"No\")","v":"No"},{"$f":"IF(IF(ISNA(INDEX('Application V2'!A:M, MATCH(Application.!A122,'Application V2'!A:A,0),12)), \"\", INDEX('Application V2'!A:M, MATCH(Application.!A122,'Application V2'!A:A,0),12))=0, \"\", IF(ISNA(INDEX('Application V2'!A:M, MATCH(Application.!A122,'Application V2'!A:A,0),12)), \"\", INDEX('Application V2'!A:M, MATCH(Application.!A122,'Application V2'!A:A,0),12)))","v":""},null,null,null,null,null,null,null,"daylightDamp"]
[113,123,null,"i "," "," e",null,"If so, describe, for instance \"IP67 pole mount\"","daylightDampText","text",null,null,null,null,null,{"$f":"IF(ISBLANK(M123),\"\",M123)","v":""},{"$f":"IF(IF(ISNA(INDEX('Application V2'!A:M, MATCH(Application.!A123,'Application V2'!A:A,0),12)), \"\", INDEX('Application V2'!A:M, MATCH(Application.!A123,'Application V2'!A:A,0),12))=0, \"\", IF(ISNA(INDEX('Application V2'!A:M, MATCH(Application.!A123,'Application V2'!A:A,0),12)), \"\", INDEX('Application V2'!A:M, MATCH(Application.!A123,'Application V2'!A:A,0),12)))","v":""},null,null,null,null,null,null,null,"daylightDampText"]
[114,124,null,null,null,"e\n","Does the system offer a networked photosensor/control module for an ANSI c136.41  5 or 7-pin socket?",null,"daylightSocketAnsi","boolean",null,null,null,null,false,{"$f":"IF(O124=TRUE,\"Yes\", \"No\")","v":"No"},{"$f":"IF(IF(ISNA(INDEX('Application V2'!A:M, MATCH(Application.!A124,'Application V2'!A:A,0),12)), \"\", INDEX('Application V2'!A:M, MATCH(Application.!A124,'Application V2'!A:A,0),12))=0, \"\", IF(ISNA(INDEX('Application V2'!A:M, MATCH(Application.!A124,'Application V2'!A:A,0),12)), \"\", INDEX('Application V2'!A:M, MATCH(Application.!A124,'Application V2'!A:A,0),12)))","v":""},null,null,null,null,null,null,null,"daylightSocketAnsi"]
[115,125,null,null,null,"e\n","Does the system offer a networked photosensor/control module for a Zhaga Book 18 socket?",null,"daylightSocketZhaga","boolean",null,null,null,null,false,{"$f":"IF(O125=TRUE,\"Yes\", \"No\")","v":"No"},{"$f":"IF(IF(ISNA(INDEX('Application V2'!A:M, MATCH(Application.!A125,'Application V2'!A:A,0),12)), \"\", INDEX('Application V2'!A:M, MATCH(Application.!A125,'Application V2'!A:A,0),12))=0, \"\", IF(ISNA(INDEX('Application V2'!A:M, MATCH(Application.!A125,'Application V2'!A:A,0),12)), \"\", INDEX('Application V2'!A:M, MATCH(Application.!A125,'Application V2'!A:A,0),12)))","v":""},null,null,null,null,null,null,null,"daylightSocketZhaga"]
[116,126,"I ","  ","E","   ","4)","Daylight Harvesting / Photocell Control","blank",null,null,null,null,null,null,null,{"$f":"IF(IF(ISNA(INDEX('Application V2'!A:M, MATCH(Application.!A126,'Application V2'!A:A,0),12)), \"\", INDEX('Application V2'!A:M, MATCH(Application.!A126,'Application V2'!A:A,0),12))=0, \"\", IF(ISNA(INDEX('Application V2'!A:M, MATCH(Application.!A126,'Application V2'!A:A,0),12)), \"\", INDEX('Application V2'!A:M, MATCH(Application.!A126,'Application V2'!A:A,0),12)))","v":""},null,null,null,null,null,null,null,"blank"]
[117,127,"I ","  ","E","   ","5)","High-End Trim","blank",null,null,null,null,null,null,null,{"$f":"IF(IF(ISNA(INDEX('Application V2'!A:M, MATCH(Application.!A127,'Application V2'!A:A,0),12)), \"\", INDEX('Application V2'!A:M, MATCH(Application.!A127,'Application V2'!A:A,0),12))=0, \"\", IF(ISNA(INDEX('Application V2'!A:M, MATCH(Application.!A127,'Application V2'!A:A,0),12)), \"\", INDEX('Application V2'!A:M, MATCH(Application.!A127,'Application V2'!A:A,0),12)))","v":""},null,null,null,null,null,null,null,"blank"]
[118,128," \n \n \n  \n \n \n"," \n \n \n  \n \n \n"," \n \n \n  \n \n \n"," .\n \n \n \n \n \n \n  \n \n","Definition:  The capability to set the maximum light output to a less-than-maximum state of an individual or group of luminaires/lamps at the time of installation or commissioning. High-End Trim must be field reconfigurable.  This capability is distinct from automatic compensation for lumen depreciation, which automatically increases output as a system operates over time.\n\n*While DLC specifically requires “High-End Trim”, some manufacturers refer to this capability as “Task Tuning” or “Tuning” within their system interfaces. Refer to NEMA LSD 64-2014 for definitions of Lighting Controls Terminology. ",null,"blank",null,null,null,null,null,null,null,{"$f":"IF(IF(ISNA(INDEX('Application V2'!A:M, MATCH(Application.!A128,'Application V2'!A:A,0),12)), \"\", INDEX('Application V2'!A:M, MATCH(Application.!A128,'Application V2'!A:A,0),12))=0, \"\", IF(ISNA(INDEX('Application V2'!A:M, MATCH(Application.!A128,'Application V2'!A:A,0),12)), \"\", INDEX('Application V2'!A:M, MATCH(Application.!A128,'Application V2'!A:A,0),12)))","v":""},null,null,null,null,null,null,null,"blank"]
[119,129,"I ","   ","E","   \n","Does the system have field-reconfigurable high-end trim capability, with instructions for how to configure and/or use this feature?",null,"hasHighTrim","boolean",null,null,null,null,false,{"$f":"IF(O129=TRUE,\"Yes\", \"No\")","v":"No"},{"$f":"IF(IF(ISNA(INDEX('Application V2'!A:M, MATCH(Application.!A129,'Application V2'!A:A,0),12)), \"\", INDEX('Application V2'!A:M, MATCH(Application.!A129,'Application V2'!A:A,0),12))=0, \"\", IF(ISNA(INDEX('Application V2'!A:M, MATCH(Application.!A129,'Application V2'!A:A,0),12)), \"\", INDEX('Application V2'!A:M, MATCH(Application.!A129,'Application V2'!A:A,0),12)))","v":""},null,null,null,null,null,null,null,"hasHighTrim"]
[120,130,"  ","i ","   "," e","How low as a % of maximum can high-end trim be adjusted?",null,"highTrimMinPercent","percent",null,null,null,null,null,{"$f":"IF(ISBLANK(M130),\"\",M130)","v":""},{"$f":"IF(IF(ISNA(INDEX('Application V2'!A:M, MATCH(Application.!A130,'Application V2'!A:A,0),12)), \"\", INDEX('Application V2'!A:M, MATCH(Application.!A130,'Application V2'!A:A,0),12))=0, \"\", IF(ISNA(INDEX('Application V2'!A:M, MATCH(Application.!A130,'Application V2'!A:A,0),12)), \"\", INDEX('Application V2'!A:M, MATCH(Application.!A130,'Application V2'!A:A,0),12)))","v":""},null,null,null,null,null,null,null,"highTrimMinPercent"]
[121,131,"   ","i  ","   "," e","Does the system have the capability to report out high-end trim settings? ",null,"highTrimSettingsUI","boolean",null,null,null,null,false,{"$f":"IF(O131=TRUE,\"Yes\", \"No\")","v":"No"},{"$f":"IF(IF(ISNA(INDEX('Application V2'!A:M, MATCH(Application.!A131,'Application V2'!A:A,0),12)), \"\", INDEX('Application V2'!A:M, MATCH(Application.!A131,'Application V2'!A:A,0),12))=0, \"\", IF(ISNA(INDEX('Application V2'!A:M, MATCH(Application.!A131,'Application V2'!A:A,0),12)), \"\", INDEX('Application V2'!A:M, MATCH(Application.!A131,'Application V2'!A:A,0),12)))","v":""},null,null,null,null,null,null,null,"highTrimSettingsUI"]
[122,132," ","i\n","  "," e\n","What is the factory default setting for high-end trim, in terms of % max control signal or percent of light output for integrated systems?",null,"highTrimDefaultPercent","percent",null,null,null,null,null,{"$f":"IF(ISBLANK(M132),\"\",M132)","v":""},{"$f":"IF(IF(ISNA(INDEX('Application V2'!A:M, MATCH(Application.!A132,'Application V2'!A:A,0),12)), \"\", INDEX('Application V2'!A:M, MATCH(Application.!A132,'Application V2'!A:A,0),12))=0, \"\", IF(ISNA(INDEX('Application V2'!A:M, MATCH(Application.!A132,'Application V2'!A:A,0),12)), \"\", INDEX('Application V2'!A:M, MATCH(Application.!A132,'Application V2'!A:A,0),12)))","v":""},null,null,null,null,null,null,null,"highTrimDefaultPercent"]
[123,133,"I ","  ","E","   ","5)","High End Trim","blank",null,null,null,null,null,null,null,{"$f":"IF(IF(ISNA(INDEX('Application V2'!A:M, MATCH(Application.!A133,'Application V2'!A:A,0),12)), \"\", INDEX('Application V2'!A:M, MATCH(Application.!A133,'Application V2'!A:A,0),12))=0, \"\", IF(ISNA(INDEX('Application V2'!A:M, MATCH(Application.!A133,'Application V2'!A:A,0),12)), \"\", INDEX('Application V2'!A:M, MATCH(Application.!A133,'Application V2'!A:A,0),12)))","v":""},null,null,null,null,null,null,null,"blank"]
[124,134,"I ","  ","E","   ","6)","Zoning","blank",null,null,null,null,null,null,null,{"$f":"IF(IF(ISNA(INDEX('Application V2'!A:M, MATCH(Application.!A134,'Application V2'!A:A,0),12)), \"\", INDEX('Application V2'!A:M, MATCH(Application.!A134,'Application V2'!A:A,0),12))=0, \"\", IF(ISNA(INDEX('Application V2'!A:M, MATCH(Application.!A134,'Application V2'!A:A,0),12)), \"\", INDEX('Application V2'!A:M, MATCH(Application.!A134,'Application V2'!A:A,0),12)))","v":""},null,null,null,null,null,null,null,"blank"]
[125,135," \n  \n \n \n \n \n \n \n \n"," \n  \n \n \n \n \n \n \n \n"," \n  \n \n \n \n \n \n \n \n"," \n  \n \n \n \n \n \n \n\n \n","Definition:  The capability to group luminaires/lamps and form unique lighting control zones for a control strategy via software-defined means, and not via physical configuration of mechanical or electrical installation details (e.g. wiring). \n     Interior:  Zoning is required for Occupancy Sensing, High End Trim, and Daylight Harvesting control strategies except for systems that feature Luminaire Level Lighting Control (LLLC) capabilities as defined in this specification under “Reported Capabilities”, in which case zoning is only required for Occupancy Sensing and High-End Trim control strategies.\n     Exterior: Zoning is required for High End Trim",null,"blank",null,null,null,null,null,null,null,{"$f":"IF(IF(ISNA(INDEX('Application V2'!A:M, MATCH(Application.!A135,'Application V2'!A:A,0),12)), \"\", INDEX('Application V2'!A:M, MATCH(Application.!A135,'Application V2'!A:A,0),12))=0, \"\", IF(ISNA(INDEX('Application V2'!A:M, MATCH(Application.!A135,'Application V2'!A:A,0),12)), \"\", INDEX('Application V2'!A:M, MATCH(Application.!A135,'Application V2'!A:A,0),12)))","v":""},null,null,null,null,null,null,null,"blank"]
[126,136,"I ","  ","E\n .","   ","Does the system have Zoning capability as defined, with instructions for how to configure and/or use this feature?",null,"hasZoning","boolean",null,null,null,null,false,{"$f":"IF(O136=TRUE,\"Yes\", \"No\")","v":"No"},{"$f":"IF(IF(ISNA(INDEX('Application V2'!A:M, MATCH(Application.!A136,'Application V2'!A:A,0),12)), \"\", INDEX('Application V2'!A:M, MATCH(Application.!A136,'Application V2'!A:A,0),12))=0, \"\", IF(ISNA(INDEX('Application V2'!A:M, MATCH(Application.!A136,'Application V2'!A:A,0),12)), \"\", INDEX('Application V2'!A:M, MATCH(Application.!A136,'Application V2'!A:A,0),12)))","v":""},null,null,null,null,null,null,null,"hasZoning"]
[127,137,"I ","  ","E","   ","6)","Zoning","blank",null,null,null,null,null,null,null,{"$f":"IF(IF(ISNA(INDEX('Application V2'!A:M, MATCH(Application.!A137,'Application V2'!A:A,0),12)), \"\", INDEX('Application V2'!A:M, MATCH(Application.!A137,'Application V2'!A:A,0),12))=0, \"\", IF(ISNA(INDEX('Application V2'!A:M, MATCH(Application.!A137,'Application V2'!A:A,0),12)), \"\", INDEX('Application V2'!A:M, MATCH(Application.!A137,'Application V2'!A:A,0),12)))","v":""},null,null,null,null,null,null,null,"blank"]
[128,138,"I ","  ","E","   ","7)","Individual Addressability","blank",null,null,null,null,null,null,null,{"$f":"IF(IF(ISNA(INDEX('Application V2'!A:M, MATCH(Application.!A138,'Application V2'!A:A,0),12)), \"\", INDEX('Application V2'!A:M, MATCH(Application.!A138,'Application V2'!A:A,0),12))=0, \"\", IF(ISNA(INDEX('Application V2'!A:M, MATCH(Application.!A138,'Application V2'!A:A,0),12)), \"\", INDEX('Application V2'!A:M, MATCH(Application.!A138,'Application V2'!A:A,0),12)))","v":""},null,null,null,null,null,null,null,"blank"]
[129,139," \n \n \n \n \n"," \n \n  \n \n \n"," \n \n  \n \n \n"," \n \n  \n \n \n","Definition:  The ability to uniquely identify and/or address each individual luminaire/lamp, sensor, controller, and user interface device in the lighting system, allowing for configuration and re-configuration of devices and control zones independent of electrical circuiting. ",null,"blank",null,null,null,null,null,null,null,{"$f":"IF(IF(ISNA(INDEX('Application V2'!A:M, MATCH(Application.!A139,'Application V2'!A:A,0),12)), \"\", INDEX('Application V2'!A:M, MATCH(Application.!A139,'Application V2'!A:A,0),12))=0, \"\", IF(ISNA(INDEX('Application V2'!A:M, MATCH(Application.!A139,'Application V2'!A:A,0),12)), \"\", INDEX('Application V2'!A:M, MATCH(Application.!A139,'Application V2'!A:A,0),12)))","v":""},null,null,null,null,null,null,null,"blank"]
[130,140,"I","  ","E","   ","Does the system have Luminaire and Device Addressability capability?",null,"hasAddressability","boolean",null,null,null,null,false,{"$f":"IF(O140=TRUE,\"Yes\", \"No\")","v":"No"},{"$f":"IF(IF(ISNA(INDEX('Application V2'!A:M, MATCH(Application.!A140,'Application V2'!A:A,0),12)), \"\", INDEX('Application V2'!A:M, MATCH(Application.!A140,'Application V2'!A:A,0),12))=0, \"\", IF(ISNA(INDEX('Application V2'!A:M, MATCH(Application.!A140,'Application V2'!A:A,0),12)), \"\", INDEX('Application V2'!A:M, MATCH(Application.!A140,'Application V2'!A:A,0),12)))","v":""},null,null,null,null,null,null,null,"hasAddressability"]
[131,141,null,null,null,"e","(External only) After edge devices have been powered up, can each edge device be assigned an individual address for that device, without manual manipulation of the device?",null,"addressableAutomatic","boolean",null,null,null,null,false,"No",null,null,null,null,null,null,null,null,"addressableAutomatic"]
[132,142,null,"i\n.",null,"e","Does the system have the capability to integrate/embed a networked controller directly into a lighting product at the time of manufacture?  (Note:  if sensors for occupancy and daylight are also integrated, see the LLLC section rather than the following questions in this section). ",null,"hasLC","boolean",null,null,null,null,false,"No",null,null,null,null,null,null,null,null,"hasLC"]
[133,143,null,"i\n.",null,"e","What luminaires with integrated controllers (but not both occupancy- and photo- sensors) would you like to display on the DLC QPL?  ",null,"LCtextLuminaires","text",null,null,null,null,null,{"$f":"IF(ISBLANK(M143),\"\",M143)","v":""},null,null,null,null,null,null,null,null,"LCtextLuminaires"]
[134,144,null,"i\n.",null,"e","What kits with integrated controllers (but not both occupancy- and photo- sensors) would you like to display on the DLC QPL?  ",null,"LCtextKits","text",null,null,null,null,null,{"$f":"IF(ISBLANK(M144),\"\",M144)","v":""},null,null,null,null,null,null,null,null,"LCtextKits"]
[135,145,null,"i\n.",null,"e","What lamps with integrated controllers (but not both occupancy- and photo- sensors) would you like to display on the DLC QPL?  ",null,"LCtextLamps","text",null,null,null,null,null,{"$f":"IF(ISBLANK(M145),\"\",M145)","v":""},null,null,null,null,null,null,null,null,"LCtextLamps"]
[136,146,null,"i\n.\n",null,"e",null,"If you choose to claim the LC capability, but not to list any luminaires, kits or lamps publicly in the row above, what is one example of an LC luminaire, kit or lamp, that DLC will confirm, but not display on the QPL?","LCtextLuminairesPrivate","text",null,null,null,null,null,{"$f":"IF(ISBLANK(M146),\"\",M146)","v":""},null,null,null,null,null,null,null,null,"LCtextLuminairesPrivate"]
[137,147,null,null,null,null,"(row intentionally blank until V5)"]
[138,148,null,"i\n.",null,"e","What communication / wiring protocol is used between the integrated control module and the driver?\"",null,"LCsensorCommConcat","concat 149:155",null,null,null,null,null,null,null,null,null,null,null,null,null,null,"sensorCommConcat"]
[139,149,null,"i",null,"e",null,"IoT Ready type 0 0-10V analog","LCsensorCommIotAnalog","boolean",null,null,null,null,false,{"$f":"IF(O149=TRUE,\"Yes\", \"No\")","v":"No"},null,null,null,null,null,null,null,null,"sensorCommIotAnalog"]
[140,150,null,"i",null,"e",null,"IoT Ready type 1 RS-232 digital","LCsensorCommIotDigital","boolean",null,null,null,null,false,"No",null,null,null,null,null,null,null,null,"sensorCommIotDigital"]
[141,151,null,"i",null,"e",null,"0-10V analog","LCsensorComm010V","boolean",null,null,null,null,false,"No",null,null,null,null,null,null,null,null,"sensorComm010V"]
[142,152,null,"i",null,"e",null,"DALI SR (Philips Xitanium SR, Osram DEXAL, etc)","LCsensorCommDaliSr","boolean",null,null,null,null,false,"No",null,null,null,null,null,null,null,null,"sensorCommDaliSr"]
[142.1,153,null,"i",null,"e",null," D4i","LCsensorCommD4i","boolean",null,null,null,null,false,"No"]
[142.19999999999999,154,null,"i",null,"e",null,"Zhaga Book 20","LCsensorCommZhaga20","boolean",null,null,null,null,false,"No"]
[143,155,null,"i",null,"e",null,"Other (explain)","LCsensorCommOther","text",null,null,null,null,null,{"$f":"IF(ISBLANK(M155),\"\",M155)","v":""},null,null,null,null,null,null,null,null,"sensorCommOther"]
[144,156,"I ","  ","E","   ","7)","Individual Addressability","blank",null,null,null,null,null,null,null,{"$f":"IF(IF(ISNA(INDEX('Application V2'!A:M, MATCH(Application.!A156,'Application V2'!A:A,0),12)), \"\", INDEX('Application V2'!A:M, MATCH(Application.!A156,'Application V2'!A:A,0),12))=0, \"\", IF(ISNA(INDEX('Application V2'!A:M, MATCH(Application.!A156,'Application V2'!A:A,0),12)), \"\", INDEX('Application V2'!A:M, MATCH(Application.!A156,'Application V2'!A:A,0),12)))","v":""},null,null,null,null,null,null,null,"blank"]
[145,157,"I ","  ","E","   ","8)","Continuous Dimming","blank",null,null,null,null,null,null,null,{"$f":"IF(IF(ISNA(INDEX('Application V2'!A:M, MATCH(Application.!A157,'Application V2'!A:A,0),12)), \"\", INDEX('Application V2'!A:M, MATCH(Application.!A157,'Application V2'!A:A,0),12))=0, \"\", IF(ISNA(INDEX('Application V2'!A:M, MATCH(Application.!A157,'Application V2'!A:A,0),12)), \"\", INDEX('Application V2'!A:M, MATCH(Application.!A157,'Application V2'!A:A,0),12)))","v":""},null,null,null,null,null,null,null,"blank"]
[146,158," \n \n \n \n"," \n \n \n \n"," \n \n \n \n"," \n \n \n \n","Definition:  The capability of a control system to provide control with sufficient resolution (100+ steps) to support light level changes perceived as smooth (as opposed to step dimming with a small number of discrete light levels).",null,"blank",null,null,null,null,null,null,null,{"$f":"IF(IF(ISNA(INDEX('Application V2'!A:M, MATCH(Application.!A158,'Application V2'!A:A,0),12)), \"\", INDEX('Application V2'!A:M, MATCH(Application.!A158,'Application V2'!A:A,0),12))=0, \"\", IF(ISNA(INDEX('Application V2'!A:M, MATCH(Application.!A158,'Application V2'!A:A,0),12)), \"\", INDEX('Application V2'!A:M, MATCH(Application.!A158,'Application V2'!A:A,0),12)))","v":""},null,null,null,null,null,null,null,"blank"]
[147,159,"I \n ","  \n ","E","   \n ","Does the system provide continuous dimming according to the definition above for at least one mode of operation?",null,"hasDimContinuous","boolean",null,null,null,null,false,{"$f":"IF(O159=TRUE,\"Yes\", \"No\")","v":"No"},{"$f":"IF(IF(ISNA(INDEX('Application V2'!A:M, MATCH(Application.!A159,'Application V2'!A:A,0),12)), \"\", INDEX('Application V2'!A:M, MATCH(Application.!A159,'Application V2'!A:A,0),12))=0, \"\", IF(ISNA(INDEX('Application V2'!A:M, MATCH(Application.!A159,'Application V2'!A:A,0),12)), \"\", INDEX('Application V2'!A:M, MATCH(Application.!A159,'Application V2'!A:A,0),12)))","v":""},null,null,null,null,null,null,null,"hasDimContinuous"]
[148,160,"  \n ","i \n ","   \n "," e\n ","What dimming curve(s) does the control system (not the luminaire/driver) use? ",null,"dimCurveConcat","concat 161:163",null,null,"Select all that apply",null,null,null,{"$f":"IF(IF(ISNA(INDEX('Application V2'!A:M, MATCH(Application.!A160,'Application V2'!A:A,0),12)), \"\", INDEX('Application V2'!A:M, MATCH(Application.!A160,'Application V2'!A:A,0),12))=0, \"\", IF(ISNA(INDEX('Application V2'!A:M, MATCH(Application.!A160,'Application V2'!A:A,0),12)), \"\", INDEX('Application V2'!A:M, MATCH(Application.!A160,'Application V2'!A:A,0),12)))","v":""},null,null,null,null,null,null,null,"dimCurveConcat"]
[149,161,"  ","i ","   "," e",null,"Linear","dimCurveLinear","boolean",null,null,null,null,false,{"$f":"IF(O161=TRUE,\"Yes\", \"No\")","v":"No"},{"$f":"IF(IF(ISNA(INDEX('Application V2'!A:M, MATCH(Application.!A161,'Application V2'!A:A,0),12)), \"\", INDEX('Application V2'!A:M, MATCH(Application.!A161,'Application V2'!A:A,0),12))=0, \"\", IF(ISNA(INDEX('Application V2'!A:M, MATCH(Application.!A161,'Application V2'!A:A,0),12)), \"\", INDEX('Application V2'!A:M, MATCH(Application.!A161,'Application V2'!A:A,0),12)))","v":""},null,null,null,null,null,null,null,"dimCurveLinear"]
[150,162,"  ","i ","   "," e",null,"Logarithmic","dimCurveLog","boolean",null,null,null,null,false,{"$f":"IF(O162=TRUE,\"Yes\", \"No\")","v":"No"},{"$f":"IF(IF(ISNA(INDEX('Application V2'!A:M, MATCH(Application.!A162,'Application V2'!A:A,0),12)), \"\", INDEX('Application V2'!A:M, MATCH(Application.!A162,'Application V2'!A:A,0),12))=0, \"\", IF(ISNA(INDEX('Application V2'!A:M, MATCH(Application.!A162,'Application V2'!A:A,0),12)), \"\", INDEX('Application V2'!A:M, MATCH(Application.!A162,'Application V2'!A:A,0),12)))","v":""},null,null,null,null,null,null,null,"dimCurveLog"]
[151,163,"  ","i ","   "," e",null,"Other (explain)","dimCurveOther","text",null,null,null,null,null,{"$f":"IF(ISBLANK(M163),\"\",M163)","v":""},{"$f":"IF(IF(ISNA(INDEX('Application V2'!A:M, MATCH(Application.!A163,'Application V2'!A:A,0),12)), \"\", INDEX('Application V2'!A:M, MATCH(Application.!A163,'Application V2'!A:A,0),12))=0, \"\", IF(ISNA(INDEX('Application V2'!A:M, MATCH(Application.!A163,'Application V2'!A:A,0),12)), \"\", INDEX('Application V2'!A:M, MATCH(Application.!A163,'Application V2'!A:A,0),12)))","v":""},null,null,null,null,null,null,null,"dimCurveOther"]
[152,164,"  ","i ","   "," e","Does the product comply with either of the following dimming standards? ",null,"dimComplyConcat","concat 165:166",null,null,"Select all that apply",null,null,null,{"$f":"IF(IF(ISNA(INDEX('Application V2'!A:M, MATCH(Application.!A164,'Application V2'!A:A,0),12)), \"\", INDEX('Application V2'!A:M, MATCH(Application.!A164,'Application V2'!A:A,0),12))=0, \"\", IF(ISNA(INDEX('Application V2'!A:M, MATCH(Application.!A164,'Application V2'!A:A,0),12)), \"\", INDEX('Application V2'!A:M, MATCH(Application.!A164,'Application V2'!A:A,0),12)))","v":""},null,null,null,null,null,null,null,"dimComplyConcat"]
[153,165,null,"i ","   "," e",null,"DALI (IEC 62386-102)","dimComplyDali","boolean",null,null,null,null,false,{"$f":"IF(O165=TRUE,\"Yes\", \"No\")","v":"No"},{"$f":"IF(IF(ISNA(INDEX('Application V2'!A:M, MATCH(Application.!A165,'Application V2'!A:A,0),12)), \"\", INDEX('Application V2'!A:M, MATCH(Application.!A165,'Application V2'!A:A,0),12))=0, \"\", IF(ISNA(INDEX('Application V2'!A:M, MATCH(Application.!A165,'Application V2'!A:A,0),12)), \"\", INDEX('Application V2'!A:M, MATCH(Application.!A165,'Application V2'!A:A,0),12)))","v":""},null,null,null,null,null,null,null,"dimComplyDali"]
[154,166,"  ","i ","   "," e",null,"0-10V (IEC60929 Annex E)","dimComplyIEC60929anE","boolean",null,null,null,null,false,{"$f":"IF(O166=TRUE,\"Yes\", \"No\")","v":"No"},{"$f":"IF(IF(ISNA(INDEX('Application V2'!A:M, MATCH(Application.!A166,'Application V2'!A:A,0),12)), \"\", INDEX('Application V2'!A:M, MATCH(Application.!A166,'Application V2'!A:A,0),12))=0, \"\", IF(ISNA(INDEX('Application V2'!A:M, MATCH(Application.!A166,'Application V2'!A:A,0),12)), \"\", INDEX('Application V2'!A:M, MATCH(Application.!A166,'Application V2'!A:A,0),12)))","v":""},null,null,null,null,null,null,null,"dimComplyIEC60929anE"]
[155,167,"I ","  ","E","   ","8)","Continuous Dimming","blank",null,null,null,null,null,null,null,{"$f":"IF(IF(ISNA(INDEX('Application V2'!A:M, MATCH(Application.!A167,'Application V2'!A:A,0),12)), \"\", INDEX('Application V2'!A:M, MATCH(Application.!A167,'Application V2'!A:A,0),12))=0, \"\", IF(ISNA(INDEX('Application V2'!A:M, MATCH(Application.!A167,'Application V2'!A:A,0),12)), \"\", INDEX('Application V2'!A:M, MATCH(Application.!A167,'Application V2'!A:A,0),12)))","v":""},null,null,null,null,null,null,null,"blank"]
[156,168,"  ","i ","   ","e","9)","Control Persistence","blank",null,null,null,null,null,null,null,{"$f":"IF(IF(ISNA(INDEX('Application V2'!A:M, MATCH(Application.!A168,'Application V2'!A:A,0),12)), \"\", INDEX('Application V2'!A:M, MATCH(Application.!A168,'Application V2'!A:A,0),12))=0, \"\", IF(ISNA(INDEX('Application V2'!A:M, MATCH(Application.!A168,'Application V2'!A:A,0),12)), \"\", INDEX('Application V2'!A:M, MATCH(Application.!A168,'Application V2'!A:A,0),12)))","v":""},null,null,null,null,null,null,null,"blank"]
[157,169,"  \n  \n \n \n \n","i  \n","   \n  \n \n \n \n","e","The capability of a networked lighting control system’s lowest-level (“edge device”) luminaire/lamp controllers to execute three pre-programmed energy saving strategies (occupancy sensing, daylight harvesting, and high-end trim) on a \"room level\", or finer, in the absence of  communications with the next higher networked element in the system’s topology. ",null,"blank",null,null,null,null,null,null,null,{"$f":"IF(IF(ISNA(INDEX('Application V2'!A:M, MATCH(Application.!A169,'Application V2'!A:A,0),12)), \"\", INDEX('Application V2'!A:M, MATCH(Application.!A169,'Application V2'!A:A,0),12))=0, \"\", IF(ISNA(INDEX('Application V2'!A:M, MATCH(Application.!A169,'Application V2'!A:A,0),12)), \"\", INDEX('Application V2'!A:M, MATCH(Application.!A169,'Application V2'!A:A,0),12)))","v":""},null,null,null,null,null,null,null,"blank"]
[158,170,"  \n ","i \n ","   \n ","e","Does the system have the capability for control persistence according to the definition above?",null,"hasPersist","boolean",null,null,null,null,false,{"$f":"IF(O170=TRUE,\"Yes\", \"No\")","v":"No"},{"$f":"IF(IF(ISNA(INDEX('Application V2'!A:M, MATCH(Application.!A170,'Application V2'!A:A,0),12)), \"\", INDEX('Application V2'!A:M, MATCH(Application.!A170,'Application V2'!A:A,0),12))=0, \"\", IF(ISNA(INDEX('Application V2'!A:M, MATCH(Application.!A170,'Application V2'!A:A,0),12)), \"\", INDEX('Application V2'!A:M, MATCH(Application.!A170,'Application V2'!A:A,0),12)))","v":""},null,null,null,null,null,null,null,"hasPersist"]
[159,171,"   \n\n ","i  \n\n ","    \n\n ","e","Whether or not all 3 strategies are supported, what energy savings strategies continue to function without connection or due to failure of connection to higher level networked elements?",null,"persistModeConcat","concat 172:176",null,null,"Select all that apply",null,null,null,{"$f":"IF(IF(ISNA(INDEX('Application V2'!A:M, MATCH(Application.!A171,'Application V2'!A:A,0),12)), \"\", INDEX('Application V2'!A:M, MATCH(Application.!A171,'Application V2'!A:A,0),12))=0, \"\", IF(ISNA(INDEX('Application V2'!A:M, MATCH(Application.!A171,'Application V2'!A:A,0),12)), \"\", INDEX('Application V2'!A:M, MATCH(Application.!A171,'Application V2'!A:A,0),12)))","v":""},null,null,null,null,null,null,null,"persistModeConcat"]
[160,172,"  ","i ","   ","e",null,"Occupancy sensing","persistModeOcc","boolean",null,null,null,null,false,{"$f":"IF(O172=TRUE,\"Yes\", \"No\")","v":"No"},{"$f":"IF(IF(ISNA(INDEX('Application V2'!A:M, MATCH(Application.!A172,'Application V2'!A:A,0),12)), \"\", INDEX('Application V2'!A:M, MATCH(Application.!A172,'Application V2'!A:A,0),12))=0, \"\", IF(ISNA(INDEX('Application V2'!A:M, MATCH(Application.!A172,'Application V2'!A:A,0),12)), \"\", INDEX('Application V2'!A:M, MATCH(Application.!A172,'Application V2'!A:A,0),12)))","v":""},null,null,null,null,null,null,null,"persistModeOcc"]
[161,173,"  ","i ","   ","e",null,"Daylight harvesting","persistModeDaylight","boolean",null,null,null,null,false,{"$f":"IF(O173=TRUE,\"Yes\", \"No\")","v":"No"},{"$f":"IF(IF(ISNA(INDEX('Application V2'!A:M, MATCH(Application.!A173,'Application V2'!A:A,0),12)), \"\", INDEX('Application V2'!A:M, MATCH(Application.!A173,'Application V2'!A:A,0),12))=0, \"\", IF(ISNA(INDEX('Application V2'!A:M, MATCH(Application.!A173,'Application V2'!A:A,0),12)), \"\", INDEX('Application V2'!A:M, MATCH(Application.!A173,'Application V2'!A:A,0),12)))","v":""},null,null,null,null,null,null,null,"persistModeDaylight"]
[162,174,"  ","i ","   ","e",null,"High end trim/ task tuning","persistModeHighTrim","boolean",null,null,null,null,false,{"$f":"IF(O174=TRUE,\"Yes\", \"No\")","v":"No"},{"$f":"IF(IF(ISNA(INDEX('Application V2'!A:M, MATCH(Application.!A174,'Application V2'!A:A,0),12)), \"\", INDEX('Application V2'!A:M, MATCH(Application.!A174,'Application V2'!A:A,0),12))=0, \"\", IF(ISNA(INDEX('Application V2'!A:M, MATCH(Application.!A174,'Application V2'!A:A,0),12)), \"\", INDEX('Application V2'!A:M, MATCH(Application.!A174,'Application V2'!A:A,0),12)))","v":""},null,null,null,null,null,null,null,"persistModeHighTrim"]
[163,175,"  ","i ","   ",null,null,"Personal control","persistModePersonal","boolean",null,null,null,null,false,{"$f":"IF(O175=TRUE,\"Yes\", \"No\")","v":"No"},{"$f":"IF(IF(ISNA(INDEX('Application V2'!A:M, MATCH(Application.!A175,'Application V2'!A:A,0),12)), \"\", INDEX('Application V2'!A:M, MATCH(Application.!A175,'Application V2'!A:A,0),12))=0, \"\", IF(ISNA(INDEX('Application V2'!A:M, MATCH(Application.!A175,'Application V2'!A:A,0),12)), \"\", INDEX('Application V2'!A:M, MATCH(Application.!A175,'Application V2'!A:A,0),12)))","v":""},null,null,null,null,null,null,null,"persistModePersonal"]
[164,176,"  ","i ","   ","e",null,"Local Manual Switch","persistModeLocalSwitch","boolean",null,null,null,null,false,{"$f":"IF(O176=TRUE,\"Yes\", \"No\")","v":"No"},{"$f":"IF(IF(ISNA(INDEX('Application V2'!A:M, MATCH(Application.!A176,'Application V2'!A:A,0),12)), \"\", INDEX('Application V2'!A:M, MATCH(Application.!A176,'Application V2'!A:A,0),12))=0, \"\", IF(ISNA(INDEX('Application V2'!A:M, MATCH(Application.!A176,'Application V2'!A:A,0),12)), \"\", INDEX('Application V2'!A:M, MATCH(Application.!A176,'Application V2'!A:A,0),12)))","v":""},null,null,null,null,null,null,null,"persistModeLocalSwitch"]
[165,177,null,"i ","   ","e","Where are programmable parameters stored for control persistence?",null,"persistDataConcat","concat 178:181",null,null,null,null,null,null,{"$f":"IF(IF(ISNA(INDEX('Application V2'!A:M, MATCH(Application.!A177,'Application V2'!A:A,0),12)), \"\", INDEX('Application V2'!A:M, MATCH(Application.!A177,'Application V2'!A:A,0),12))=0, \"\", IF(ISNA(INDEX('Application V2'!A:M, MATCH(Application.!A177,'Application V2'!A:A,0),12)), \"\", INDEX('Application V2'!A:M, MATCH(Application.!A177,'Application V2'!A:A,0),12)))","v":""},null,null,null,null,null,null,null,"persistDataConcat"]
[166,178,null,"i ","   ","e",null,"In the sensor","persistDataSensor","boolean",null,null,null,null,false,{"$f":"IF(O178=TRUE,\"Yes\", \"No\")","v":"No"},{"$f":"IF(IF(ISNA(INDEX('Application V2'!A:M, MATCH(Application.!A178,'Application V2'!A:A,0),12)), \"\", INDEX('Application V2'!A:M, MATCH(Application.!A178,'Application V2'!A:A,0),12))=0, \"\", IF(ISNA(INDEX('Application V2'!A:M, MATCH(Application.!A178,'Application V2'!A:A,0),12)), \"\", INDEX('Application V2'!A:M, MATCH(Application.!A178,'Application V2'!A:A,0),12)))","v":""},null,null,null,null,null,null,null,"persistDataSensor"]
[167,179,null,"i ","   ","e",null,"In the controller","persistDataController","boolean",null,null,null,null,false,{"$f":"IF(O179=TRUE,\"Yes\", \"No\")","v":"No"},{"$f":"IF(IF(ISNA(INDEX('Application V2'!A:M, MATCH(Application.!A179,'Application V2'!A:A,0),12)), \"\", INDEX('Application V2'!A:M, MATCH(Application.!A179,'Application V2'!A:A,0),12))=0, \"\", IF(ISNA(INDEX('Application V2'!A:M, MATCH(Application.!A179,'Application V2'!A:A,0),12)), \"\", INDEX('Application V2'!A:M, MATCH(Application.!A179,'Application V2'!A:A,0),12)))","v":""},null,null,null,null,null,null,null,"persistDataController"]
[168,180,null,"i ","   ","e",null,"In the driver","persistDataDriver","boolean",null,null,null,null,false,{"$f":"IF(O180=TRUE,\"Yes\", \"No\")","v":"No"},{"$f":"IF(IF(ISNA(INDEX('Application V2'!A:M, MATCH(Application.!A180,'Application V2'!A:A,0),12)), \"\", INDEX('Application V2'!A:M, MATCH(Application.!A180,'Application V2'!A:A,0),12))=0, \"\", IF(ISNA(INDEX('Application V2'!A:M, MATCH(Application.!A180,'Application V2'!A:A,0),12)), \"\", INDEX('Application V2'!A:M, MATCH(Application.!A180,'Application V2'!A:A,0),12)))","v":""},null,null,null,null,null,null,null,"persistDataDriver"]
[169,181,null,"i ","   ","e",null,"Other (explain)","persistDataOther","text",null,null,null,null,null,{"$f":"IF(ISBLANK(M181),\"\",M181)","v":""},{"$f":"IF(IF(ISNA(INDEX('Application V2'!A:M, MATCH(Application.!A181,'Application V2'!A:A,0),12)), \"\", INDEX('Application V2'!A:M, MATCH(Application.!A181,'Application V2'!A:A,0),12))=0, \"\", IF(ISNA(INDEX('Application V2'!A:M, MATCH(Application.!A181,'Application V2'!A:A,0),12)), \"\", INDEX('Application V2'!A:M, MATCH(Application.!A181,'Application V2'!A:A,0),12)))","v":""},null,null,null,null,null,null,null,"persistDataOther"]
[170,182,"  ","i ","   ","e","9)","Control Persistence","blank",null,null,null,null,null,null,null,{"$f":"IF(IF(ISNA(INDEX('Application V2'!A:M, MATCH(Application.!A182,'Application V2'!A:A,0),12)), \"\", INDEX('Application V2'!A:M, MATCH(Application.!A182,'Application V2'!A:A,0),12))=0, \"\", IF(ISNA(INDEX('Application V2'!A:M, MATCH(Application.!A182,'Application V2'!A:A,0),12)), \"\", INDEX('Application V2'!A:M, MATCH(Application.!A182,'Application V2'!A:A,0),12)))","v":""},null,null,null,null,null,null,null,"blank"]
[171,183,"  ","i ","E","   ","10)","Scheduling","blank",null,null,null,null,null,null,null,{"$f":"IF(IF(ISNA(INDEX('Application V2'!A:M, MATCH(Application.!A183,'Application V2'!A:A,0),12)), \"\", INDEX('Application V2'!A:M, MATCH(Application.!A183,'Application V2'!A:A,0),12))=0, \"\", IF(ISNA(INDEX('Application V2'!A:M, MATCH(Application.!A183,'Application V2'!A:A,0),12)), \"\", INDEX('Application V2'!A:M, MATCH(Application.!A183,'Application V2'!A:A,0),12)))","v":""},null,null,null,null,null,null,null,"blank"]
[172,184," \n \n  \n \n \n"," \n \n  \n \n \n"," \n \n  \n \n \n"," \n \n  \n \n \n","Definition:  The capability to automatically affect the operation of lighting equipment based on time of day.  Scheduling capability is Reported for Interior systems and Required for Exterior systems.\nExterior systems are required to have time based scheduling, and \"astronomical\" scheduling functionality for sunrise and sunset programming, based on geographical location and time of year. ",null,"blank",null,null,null,null,null,null,null,{"$f":"IF(IF(ISNA(INDEX('Application V2'!A:M, MATCH(Application.!A184,'Application V2'!A:A,0),12)), \"\", INDEX('Application V2'!A:M, MATCH(Application.!A184,'Application V2'!A:A,0),12))=0, \"\", IF(ISNA(INDEX('Application V2'!A:M, MATCH(Application.!A184,'Application V2'!A:A,0),12)), \"\", INDEX('Application V2'!A:M, MATCH(Application.!A184,'Application V2'!A:A,0),12)))","v":""},null,null,null,null,null,null,null,"blank"]
[173,185,"\n .","i","E","   ","Does the system have scheduling capability, with instructions for how to configure and/or use this feature?",null,"hasSchedule","boolean",null,null,null,null,false,{"$f":"IF(O185=TRUE,\"Yes\", \"No\")","v":"No"},{"$f":"IF(IF(ISNA(INDEX('Application V2'!A:M, MATCH(Application.!A185,'Application V2'!A:A,0),12)), \"\", INDEX('Application V2'!A:M, MATCH(Application.!A185,'Application V2'!A:A,0),12))=0, \"\", IF(ISNA(INDEX('Application V2'!A:M, MATCH(Application.!A185,'Application V2'!A:A,0),12)), \"\", INDEX('Application V2'!A:M, MATCH(Application.!A185,'Application V2'!A:A,0),12)))","v":""},null,null,null,null,null,null,null,"hasSchedule"]
[174,186,"\n .","i","E","   ","Does the system use an astronomical time-clock for scheduling (using latitude to define sunrise/sunset times)?",null,"scheduleAstroClock","boolean",null,null,null,null,false,{"$f":"IF(O186=TRUE,\"Yes\", \"No\")","v":"No"},{"$f":"IF(IF(ISNA(INDEX('Application V2'!A:M, MATCH(Application.!A186,'Application V2'!A:A,0),12)), \"\", INDEX('Application V2'!A:M, MATCH(Application.!A186,'Application V2'!A:A,0),12))=0, \"\", IF(ISNA(INDEX('Application V2'!A:M, MATCH(Application.!A186,'Application V2'!A:A,0),12)), \"\", INDEX('Application V2'!A:M, MATCH(Application.!A186,'Application V2'!A:A,0),12)))","v":""},null,null,null,null,null,null,null,"scheduleAstroClock"]
[175,187,"  ","i ","   "," e","How far ahead can events be scheduled (pick the longest 1 option from menu)",null,"scheduleLimit","text",null,null,null,null,null,{"$f":"IF(ISBLANK(M187),\"\",M187)","v":""},{"$f":"IF(IF(ISNA(INDEX('Application V2'!A:M, MATCH(Application.!A187,'Application V2'!A:A,0),12)), \"\", INDEX('Application V2'!A:M, MATCH(Application.!A187,'Application V2'!A:A,0),12))=0, \"\", IF(ISNA(INDEX('Application V2'!A:M, MATCH(Application.!A187,'Application V2'!A:A,0),12)), \"\", INDEX('Application V2'!A:M, MATCH(Application.!A187,'Application V2'!A:A,0),12)))","v":""},null,null,null,null,null,null,null,"scheduleLimit"]
[176,188,"  ","i ","   "," e",null,"If \"Other\", explain","scheduleLimitOther","text",null,null,null,null,null,{"$f":"IF(ISBLANK(M188),\"\",M188)","v":""},{"$f":"IF(IF(ISNA(INDEX('Application V2'!A:M, MATCH(Application.!A188,'Application V2'!A:A,0),12)), \"\", INDEX('Application V2'!A:M, MATCH(Application.!A188,'Application V2'!A:A,0),12))=0, \"\", IF(ISNA(INDEX('Application V2'!A:M, MATCH(Application.!A188,'Application V2'!A:A,0),12)), \"\", INDEX('Application V2'!A:M, MATCH(Application.!A188,'Application V2'!A:A,0),12)))","v":""},null,null,null,null,null,null,null,"scheduleLimitOther"]
[177,189,null,"i ","E",null,"If the system can schedule events a year or more ahead, does the system provide holiday and special schedule programming? ",null,"scheduleHoliday","boolean",null,null,null,null,false,{"$f":"IF(O189=TRUE,\"Yes\", \"No\")","v":"No"},{"$f":"IF(IF(ISNA(INDEX('Application V2'!A:M, MATCH(Application.!A189,'Application V2'!A:A,0),12)), \"\", INDEX('Application V2'!A:M, MATCH(Application.!A189,'Application V2'!A:A,0),12))=0, \"\", IF(ISNA(INDEX('Application V2'!A:M, MATCH(Application.!A189,'Application V2'!A:A,0),12)), \"\", INDEX('Application V2'!A:M, MATCH(Application.!A189,'Application V2'!A:A,0),12)))","v":""},null,null,null,null,null,null,null,"scheduleHoliday"]
[178,190,"  \n ","i \n ","   \n "," e\n ","Does the system provide the capability to override scheduling via a local override switch?",null,"scheduleLocalOverride","boolean",null,null,null,null,false,{"$f":"IF(O190=TRUE,\"Yes\", \"No\")","v":"No"},{"$f":"IF(IF(ISNA(INDEX('Application V2'!A:M, MATCH(Application.!A190,'Application V2'!A:A,0),12)), \"\", INDEX('Application V2'!A:M, MATCH(Application.!A190,'Application V2'!A:A,0),12))=0, \"\", IF(ISNA(INDEX('Application V2'!A:M, MATCH(Application.!A190,'Application V2'!A:A,0),12)), \"\", INDEX('Application V2'!A:M, MATCH(Application.!A190,'Application V2'!A:A,0),12)))","v":""},null,null,null,null,null,null,null,"scheduleLocalOverride"]
[178.1,191,null,"i",null,"e","Does the system provide the capability to override scheduling via API?",null,"scheduleApiOverride","boolean",null,null,null,null,false,{"$f":"IF(O191=TRUE,\"Yes\", \"No\")","v":"No"}]
[178.2,192,null,"i",null,"e","What standard format for calendars is supported? (select all supported)",null,"scheduleFormatConcat","concat 193:196"]
[178.3,193,null,"i",null,"e",null,"iCal","scheduleFormatiCal","boolean",null,null,null,null,false,{"$f":"IF(O193=TRUE,\"Yes\", \"No\")","v":"No"}]
[178.4,194,null,"i",null,"e",null,"Google","scheduleFormatGoogle","boolean",null,null,null,null,false,{"$f":"IF(O194=TRUE,\"Yes\", \"No\")","v":"No"}]
[178.5,195,null,"i",null,"e",null,"Outlook","scheduleFormatOutlook","boolean",null,null,null,null,false,{"$f":"IF(O195=TRUE,\"Yes\", \"No\")","v":"No"}]
[178.6,196,null,"i",null,"e",null,"Other (explain)","scheduleFormatOther","text",null,null,null,null,null,{"$f":"IF(ISBLANK(M196),\"\",M196)","v":""}]
[179,197,"  ","i ","E","   ","10)","Scheduling","blank",null,null,null,null,null,null,null,{"$f":"IF(IF(ISNA(INDEX('Application V2'!A:M, MATCH(Application.!A197,'Application V2'!A:A,0),12)), \"\", INDEX('Application V2'!A:M, MATCH(Application.!A197,'Application V2'!A:A,0),12))=0, \"\", IF(ISNA(INDEX('Application V2'!A:M, MATCH(Application.!A197,'Application V2'!A:A,0),12)), \"\", INDEX('Application V2'!A:M, MATCH(Application.!A197,'Application V2'!A:A,0),12)))","v":""},null,null,null,null,null,null,null,"blank"]
[180,198,"I ",null,"E",null,"11)","Energy Monitoring","blank",null,null,null,null,null,null,null,{"$f":"IF(IF(ISNA(INDEX('Application V2'!A:M, MATCH(Application.!A198,'Application V2'!A:A,0),12)), \"\", INDEX('Application V2'!A:M, MATCH(Application.!A198,'Application V2'!A:A,0),12))=0, \"\", IF(ISNA(INDEX('Application V2'!A:M, MATCH(Application.!A198,'Application V2'!A:A,0),12)), \"\", INDEX('Application V2'!A:M, MATCH(Application.!A198,'Application V2'!A:A,0),12)))","v":""},null,null,null,null,null,null,null,"blank"]
[181,199,"\n \n \n \n  \n \n\n\n\n\n\n\n\n\n\n\n\n\n\n\n\n\n\n\n\n","\n \n \n \n  \n \n","\n \n \n \n  \n \n","\n \n \n \n  \n \n","Definition:  The capability of a system to report the energy consumption of a luminaire/lamp and/or a group of luminaires/lamps. \n•\tIndividual luminaire/lamp monitoring as well as energy monitoring on dedicated lighting circuits is acceptable. \n•\tThe method by which the system implements this capability must be clearly described, including whether the system provides automated energy measurement or  relies on numerical manual input during system setup for accurate measurement (such as inputting the wattage of each luminaire/lamp in a project).  \n•\tReference consists of one or both of:\no\tSample .CSV file with documentation\no\tAPI documentation \n•\tThe basic, required capability of energy monitoring is aligned with ASHRAE 90.1-2016 Section 8.4.3. as follows:\no\tEnergy use by interior lighting (if applicable), exterior lighting (if applicable) and receptacle circuits (if monitored by the NLC) can be monitored independently.  \no\tFor buildings with tenants, the data for each tenant space can be reported to each tenant.  \no\tThe lighting system energy use can be recorded at least once every 15 minutes & reported at least hourly, daily, monthly, & annually, or recorded & reported upon state change.  \no\tEnergy use data can be transmitted to a building control system (if present) & graphically displayed.  \no\tSystem shall be able to store data for at least 24 months.\n•\tEnergy monitoring is “reported” for room-based systems, but not “required”.  In order for room-based systems to claim the optional energy monitoring capability:\no\tEnergy data can be retrieved by a user in the room when required - hourly, daily, monthly or yearly; or on demand.\no\tEnergy data can be retrieved in the form of a CSV file and/or API.\nIn order for a system to qualify for the room-based exemption, the DLC review process will confirm that the product claims only “Room or Zone” for interior scope as listed on the DLC QPL.",null,"blank",null,null,null,null,null,null,null,{"$f":"IF(IF(ISNA(INDEX('Application V2'!A:M, MATCH(Application.!A199,'Application V2'!A:A,0),12)), \"\", INDEX('Application V2'!A:M, MATCH(Application.!A199,'Application V2'!A:A,0),12))=0, \"\", IF(ISNA(INDEX('Application V2'!A:M, MATCH(Application.!A199,'Application V2'!A:A,0),12)), \"\", INDEX('Application V2'!A:M, MATCH(Application.!A199,'Application V2'!A:A,0),12)))","v":""},null,null,null,null,null,null,null,"blank"]
[182,200,"I ",null,"E",null,"Does the system have Energy Monitoring capability, with instructions for how to configure and/or use this feature?",null,"hasEM","boolean",null,null,null,null,false,{"$f":"IF(O200=TRUE,\"Yes\", \"No\")","v":"No"},{"$f":"IF(IF(ISNA(INDEX('Application V2'!A:M, MATCH(Application.!A200,'Application V2'!A:A,0),12)), \"\", INDEX('Application V2'!A:M, MATCH(Application.!A200,'Application V2'!A:A,0),12))=0, \"\", IF(ISNA(INDEX('Application V2'!A:M, MATCH(Application.!A200,'Application V2'!A:A,0),12)), \"\", INDEX('Application V2'!A:M, MATCH(Application.!A200,'Application V2'!A:A,0),12)))","v":""},null,null,null,null,null,null,null,"hasEM"]
[183,201,"  ","i ","   "," e","What is the methodology(s)?  (Note LUT=\"Look Up Table\")",null,"emHowConcat","concat 202:205",null,null,"Select all that apply",null,null,null,{"$f":"IF(IF(ISNA(INDEX('Application V2'!A:M, MATCH(Application.!A201,'Application V2'!A:A,0),12)), \"\", INDEX('Application V2'!A:M, MATCH(Application.!A201,'Application V2'!A:A,0),12))=0, \"\", IF(ISNA(INDEX('Application V2'!A:M, MATCH(Application.!A201,'Application V2'!A:A,0),12)), \"\", INDEX('Application V2'!A:M, MATCH(Application.!A201,'Application V2'!A:A,0),12)))","v":""},null,null,null,null,null,null,null,"emHowConcat"]
[184,202,"  ","i ","   "," e",null,"True power meter (current and voltage)","emHowTruePower","boolean",null,null,null,null,false,{"$f":"IF(O202=TRUE,\"Yes\", \"No\")","v":"No"},{"$f":"IF(IF(ISNA(INDEX('Application V2'!A:M, MATCH(Application.!A202,'Application V2'!A:A,0),12)), \"\", INDEX('Application V2'!A:M, MATCH(Application.!A202,'Application V2'!A:A,0),12))=0, \"\", IF(ISNA(INDEX('Application V2'!A:M, MATCH(Application.!A202,'Application V2'!A:A,0),12)), \"\", INDEX('Application V2'!A:M, MATCH(Application.!A202,'Application V2'!A:A,0),12)))","v":""},null,null,null,null,null,null,null,"emHowTruePower"]
[185,203,"  ","i ","   "," e",null,"Current meter with nominal voltage","emHowCurrentMeter","boolean",null,null,null,null,false,{"$f":"IF(O203=TRUE,\"Yes\", \"No\")","v":"No"},{"$f":"IF(IF(ISNA(INDEX('Application V2'!A:M, MATCH(Application.!A203,'Application V2'!A:A,0),12)), \"\", INDEX('Application V2'!A:M, MATCH(Application.!A203,'Application V2'!A:A,0),12))=0, \"\", IF(ISNA(INDEX('Application V2'!A:M, MATCH(Application.!A203,'Application V2'!A:A,0),12)), \"\", INDEX('Application V2'!A:M, MATCH(Application.!A203,'Application V2'!A:A,0),12)))","v":""},null,null,null,null,null,null,null,"emHowCurrentMeter"]
[186,204,"  ","i ","   "," e",null,"Wattage LUT without manual data entry","emHowLutAutomated","boolean",null,null,null,null,false,{"$f":"IF(O204=TRUE,\"Yes\", \"No\")","v":"No"},{"$f":"IF(IF(ISNA(INDEX('Application V2'!A:M, MATCH(Application.!A204,'Application V2'!A:A,0),12)), \"\", INDEX('Application V2'!A:M, MATCH(Application.!A204,'Application V2'!A:A,0),12))=0, \"\", IF(ISNA(INDEX('Application V2'!A:M, MATCH(Application.!A204,'Application V2'!A:A,0),12)), \"\", INDEX('Application V2'!A:M, MATCH(Application.!A204,'Application V2'!A:A,0),12)))","v":""},null,null,null,null,null,null,null,"emHowLutAutomated"]
[187,205,"  ","i ","   "," e",null,"Wattage LUT with manual data entry","emHowLutManual","boolean",null,null,null,null,false,{"$f":"IF(O205=TRUE,\"Yes\", \"No\")","v":"No"},{"$f":"IF(IF(ISNA(INDEX('Application V2'!A:M, MATCH(Application.!A205,'Application V2'!A:A,0),12)), \"\", INDEX('Application V2'!A:M, MATCH(Application.!A205,'Application V2'!A:A,0),12))=0, \"\", IF(ISNA(INDEX('Application V2'!A:M, MATCH(Application.!A205,'Application V2'!A:A,0),12)), \"\", INDEX('Application V2'!A:M, MATCH(Application.!A205,'Application V2'!A:A,0),12)))","v":""},null,null,null,null,null,null,null,"emHowLutManual"]
[188,206,"  ","i ","   "," e","If metered, where is the meter located? ",null,"emWhereConcat","concat 207:213 ",null,null,"Select all that apply",null,null,null,{"$f":"IF(IF(ISNA(INDEX('Application V2'!A:M, MATCH(Application.!A206,'Application V2'!A:A,0),12)), \"\", INDEX('Application V2'!A:M, MATCH(Application.!A206,'Application V2'!A:A,0),12))=0, \"\", IF(ISNA(INDEX('Application V2'!A:M, MATCH(Application.!A206,'Application V2'!A:A,0),12)), \"\", INDEX('Application V2'!A:M, MATCH(Application.!A206,'Application V2'!A:A,0),12)))","v":""},null,null,null,null,null,null,null,"emWhereConcat"]
[189,207,"  ","i ","   "," e",null,"Luminaire","emWhereDriver","boolean",null,null,null,null,false,{"$f":"IF(O207=TRUE,\"Yes\", \"No\")","v":"No"},{"$f":"IF(IF(ISNA(INDEX('Application V2'!A:M, MATCH(Application.!A207,'Application V2'!A:A,0),12)), \"\", INDEX('Application V2'!A:M, MATCH(Application.!A207,'Application V2'!A:A,0),12))=0, \"\", IF(ISNA(INDEX('Application V2'!A:M, MATCH(Application.!A207,'Application V2'!A:A,0),12)), \"\", INDEX('Application V2'!A:M, MATCH(Application.!A207,'Application V2'!A:A,0),12)))","v":""},null,null,null,null,null,null,null,"emWhereDriver"]
[190,208,"  ","i ","   "," e",null,"Sensor","emWhereSensor","boolean",null,null,null,null,false,"No",{"$f":"IF(IF(ISNA(INDEX('Application V2'!A:M, MATCH(Application.!A208,'Application V2'!A:A,0),12)), \"\", INDEX('Application V2'!A:M, MATCH(Application.!A208,'Application V2'!A:A,0),12))=0, \"\", IF(ISNA(INDEX('Application V2'!A:M, MATCH(Application.!A208,'Application V2'!A:A,0),12)), \"\", INDEX('Application V2'!A:M, MATCH(Application.!A208,'Application V2'!A:A,0),12)))","v":""},null,null,null,null,null,null,null,"emWhereSensor"]
[191,209,"  ","i ","   "," e",null,"Switch","emWhereSwitch","boolean",null,null,null,null,false,"No",{"$f":"IF(IF(ISNA(INDEX('Application V2'!A:M, MATCH(Application.!A209,'Application V2'!A:A,0),12)), \"\", INDEX('Application V2'!A:M, MATCH(Application.!A209,'Application V2'!A:A,0),12))=0, \"\", IF(ISNA(INDEX('Application V2'!A:M, MATCH(Application.!A209,'Application V2'!A:A,0),12)), \"\", INDEX('Application V2'!A:M, MATCH(Application.!A209,'Application V2'!A:A,0),12)))","v":""},null,null,null,null,null,null,null,"emWhereSwitch"]
[192,210,"  ","i ","   "," e",null,"Panel, split core CT","emWhereCircuitsp","boolean",null,null,null,null,false,"No",{"$f":"IF(IF(ISNA(INDEX('Application V2'!A:M, MATCH(Application.!A210,'Application V2'!A:A,0),12)), \"\", INDEX('Application V2'!A:M, MATCH(Application.!A210,'Application V2'!A:A,0),12))=0, \"\", IF(ISNA(INDEX('Application V2'!A:M, MATCH(Application.!A210,'Application V2'!A:A,0),12)), \"\", INDEX('Application V2'!A:M, MATCH(Application.!A210,'Application V2'!A:A,0),12)))","v":""},null,null,null,null,null,null,null,"emWhereCircuit"]
[192.1,211,null,"i",null,"e",null,"Panel, solid core CT","emWhereCircuitso","boolean",null,null,null,null,false,"No"]
[193,212,"  ","i ","   "," e",null,"Plugload electrical outlet","emWherePlugload","boolean",null,null,null,null,false,"No",{"$f":"IF(IF(ISNA(INDEX('Application V2'!A:M, MATCH(Application.!A212,'Application V2'!A:A,0),12)), \"\", INDEX('Application V2'!A:M, MATCH(Application.!A212,'Application V2'!A:A,0),12))=0, \"\", IF(ISNA(INDEX('Application V2'!A:M, MATCH(Application.!A212,'Application V2'!A:A,0),12)), \"\", INDEX('Application V2'!A:M, MATCH(Application.!A212,'Application V2'!A:A,0),12)))","v":""},null,null,null,null,null,null,null,"emWherePlugload"]
[194,213,"  ","i ","   "," e",null,"Other (explain)","emWhereLocationOther","text",null,null,null,null,null,{"$f":"IF(ISBLANK(M213),\"\",M213)","v":""},{"$f":"IF(IF(ISNA(INDEX('Application V2'!A:M, MATCH(Application.!A213,'Application V2'!A:A,0),12)), \"\", INDEX('Application V2'!A:M, MATCH(Application.!A213,'Application V2'!A:A,0),12))=0, \"\", IF(ISNA(INDEX('Application V2'!A:M, MATCH(Application.!A213,'Application V2'!A:A,0),12)), \"\", INDEX('Application V2'!A:M, MATCH(Application.!A213,'Application V2'!A:A,0),12)))","v":""},null,null,null,null,null,null,null,"emWhereLocationOther"]
[195,214,"\n","i ","   "," e","How long is 15-minute energy data available in the system?  For instance, is it deleted after a week, or 30 days, or a year?",null,"emHistoryAggregate","text",null,null,null,null,null,{"$f":"IF(ISBLANK(M214),\"\",M214)","v":""},{"$f":"IF(IF(ISNA(INDEX('Application V2'!A:M, MATCH(Application.!A214,'Application V2'!A:A,0),12)), \"\", INDEX('Application V2'!A:M, MATCH(Application.!A214,'Application V2'!A:A,0),12))=0, \"\", IF(ISNA(INDEX('Application V2'!A:M, MATCH(Application.!A214,'Application V2'!A:A,0),12)), \"\", INDEX('Application V2'!A:M, MATCH(Application.!A214,'Application V2'!A:A,0),12)))","v":""},null,null,null,null,null,null,null,"emHistoryAggregate"]
[196,215,"\n","i ","   "," e","What is the smallest spatial resolution of the data record? Choose one from menu.",null,"emSpatialRecordMin","text",null,null,null,null,null,"",{"$f":"IF(IF(ISNA(INDEX('Application V2'!A:M, MATCH(Application.!A215,'Application V2'!A:A,0),12)), \"\", INDEX('Application V2'!A:M, MATCH(Application.!A215,'Application V2'!A:A,0),12))=0, \"\", IF(ISNA(INDEX('Application V2'!A:M, MATCH(Application.!A215,'Application V2'!A:A,0),12)), \"\", INDEX('Application V2'!A:M, MATCH(Application.!A215,'Application V2'!A:A,0),12)))","v":""},null,null,null,null,null,null,null,"emSpatialRecordMin"]
[197,216,"  \n ","i \n ","   \n "," e\n ","What loads contribute to the power/energy consumption reported in a data point?",null,"dataFileConsumptionConcat","concat 217:222",null,null,null,null,null,null,{"$f":"IF(IF(ISNA(INDEX('Application V2'!A:M, MATCH(Application.!A216,'Application V2'!A:A,0),12)), \"\", INDEX('Application V2'!A:M, MATCH(Application.!A216,'Application V2'!A:A,0),12))=0, \"\", IF(ISNA(INDEX('Application V2'!A:M, MATCH(Application.!A216,'Application V2'!A:A,0),12)), \"\", INDEX('Application V2'!A:M, MATCH(Application.!A216,'Application V2'!A:A,0),12)))","v":""},null,null,null,null,null,null,null,"dataFileConsumptionConcat"]
[198,217,"  ","i ","   "," e",null,"Light engine/lamp","dataFileConsumptionLight","boolean",null,null,null,null,false,{"$f":"IF(O217=TRUE,\"Yes\", \"No\")","v":"No"},{"$f":"IF(IF(ISNA(INDEX('Application V2'!A:M, MATCH(Application.!A217,'Application V2'!A:A,0),12)), \"\", INDEX('Application V2'!A:M, MATCH(Application.!A217,'Application V2'!A:A,0),12))=0, \"\", IF(ISNA(INDEX('Application V2'!A:M, MATCH(Application.!A217,'Application V2'!A:A,0),12)), \"\", INDEX('Application V2'!A:M, MATCH(Application.!A217,'Application V2'!A:A,0),12)))","v":""},null,null,null,null,null,null,null,"dataFileConsumptionLight"]
[199,218,"  ","i ","   "," e",null,"Driver/ballast","dataFileConsumptionDriver","boolean",null,null,null,null,false,{"$f":"IF(O218=TRUE,\"Yes\", \"No\")","v":"No"},{"$f":"IF(IF(ISNA(INDEX('Application V2'!A:M, MATCH(Application.!A218,'Application V2'!A:A,0),12)), \"\", INDEX('Application V2'!A:M, MATCH(Application.!A218,'Application V2'!A:A,0),12))=0, \"\", IF(ISNA(INDEX('Application V2'!A:M, MATCH(Application.!A218,'Application V2'!A:A,0),12)), \"\", INDEX('Application V2'!A:M, MATCH(Application.!A218,'Application V2'!A:A,0),12)))","v":""},null,null,null,null,null,null,null,"dataFileConsumptionDriver"]
[200,219,"  ","i ","   "," e",null,"Sensors","dataFileConsumptionSensor","boolean",null,null,null,null,false,{"$f":"IF(O219=TRUE,\"Yes\", \"No\")","v":"No"},{"$f":"IF(IF(ISNA(INDEX('Application V2'!A:M, MATCH(Application.!A219,'Application V2'!A:A,0),12)), \"\", INDEX('Application V2'!A:M, MATCH(Application.!A219,'Application V2'!A:A,0),12))=0, \"\", IF(ISNA(INDEX('Application V2'!A:M, MATCH(Application.!A219,'Application V2'!A:A,0),12)), \"\", INDEX('Application V2'!A:M, MATCH(Application.!A219,'Application V2'!A:A,0),12)))","v":""},null,null,null,null,null,null,null,"dataFileConsumptionSensor"]
[201,220,"  ","i ","   "," e",null,"Gateway/Bridge/Switch","dataFileConsumptionGateway","boolean",null,null,null,null,false,{"$f":"IF(O220=TRUE,\"Yes\", \"No\")","v":"No"},{"$f":"IF(IF(ISNA(INDEX('Application V2'!A:M, MATCH(Application.!A220,'Application V2'!A:A,0),12)), \"\", INDEX('Application V2'!A:M, MATCH(Application.!A220,'Application V2'!A:A,0),12))=0, \"\", IF(ISNA(INDEX('Application V2'!A:M, MATCH(Application.!A220,'Application V2'!A:A,0),12)), \"\", INDEX('Application V2'!A:M, MATCH(Application.!A220,'Application V2'!A:A,0),12)))","v":""},null,null,null,null,null,null,null,"dataFileConsumptionGateway"]
[202,221,"  ","i ","   "," e",null,"Server","dataFileConsumptionServer","boolean",null,null,null,null,false,{"$f":"IF(O221=TRUE,\"Yes\", \"No\")","v":"No"},{"$f":"IF(IF(ISNA(INDEX('Application V2'!A:M, MATCH(Application.!A221,'Application V2'!A:A,0),12)), \"\", INDEX('Application V2'!A:M, MATCH(Application.!A221,'Application V2'!A:A,0),12))=0, \"\", IF(ISNA(INDEX('Application V2'!A:M, MATCH(Application.!A221,'Application V2'!A:A,0),12)), \"\", INDEX('Application V2'!A:M, MATCH(Application.!A221,'Application V2'!A:A,0),12)))","v":""},null,null,null,null,null,null,null,"dataFileConsumptionServer"]
[203,222,"  ","i ","   "," e",null,"Other (explain)","dataFileConsumptionOther","text",null,null,null,null,null,{"$f":"IF(ISBLANK(M222),\"\",M222)","v":""},{"$f":"IF(IF(ISNA(INDEX('Application V2'!A:M, MATCH(Application.!A222,'Application V2'!A:A,0),12)), \"\", INDEX('Application V2'!A:M, MATCH(Application.!A222,'Application V2'!A:A,0),12))=0, \"\", IF(ISNA(INDEX('Application V2'!A:M, MATCH(Application.!A222,'Application V2'!A:A,0),12)), \"\", INDEX('Application V2'!A:M, MATCH(Application.!A222,'Application V2'!A:A,0),12)))","v":""},null,null,null,null,null,null,null,"dataFileConsumptionOther"]
[204,223,"  ","i ","   "," e","Is optional hardware or software needed for energy monitoring?",null,"emOptional","boolean",null,null,null,null,false,{"$f":"IF(O223=TRUE,\"Yes\", \"No\")","v":"No"},{"$f":"IF(IF(ISNA(INDEX('Application V2'!A:M, MATCH(Application.!A223,'Application V2'!A:A,0),12)), \"\", INDEX('Application V2'!A:M, MATCH(Application.!A223,'Application V2'!A:A,0),12))=0, \"\", IF(ISNA(INDEX('Application V2'!A:M, MATCH(Application.!A223,'Application V2'!A:A,0),12)), \"\", INDEX('Application V2'!A:M, MATCH(Application.!A223,'Application V2'!A:A,0),12)))","v":""},null,null,null,null,null,null,null,"emOptional"]
[205,224,"  ","i ","   "," e",null,"If so, what equipment is needed?","emOptionalComponents","text",null,null,null,null,null,{"$f":"IF(ISBLANK(M224),\"\",M224)","v":""},{"$f":"IF(IF(ISNA(INDEX('Application V2'!A:M, MATCH(Application.!A224,'Application V2'!A:A,0),12)), \"\", INDEX('Application V2'!A:M, MATCH(Application.!A224,'Application V2'!A:A,0),12))=0, \"\", IF(ISNA(INDEX('Application V2'!A:M, MATCH(Application.!A224,'Application V2'!A:A,0),12)), \"\", INDEX('Application V2'!A:M, MATCH(Application.!A224,'Application V2'!A:A,0),12)))","v":""},null,null,null,null,null,null,null,"emOptionalComponents"]
[206,225,"  ","i  "," "," e","What data is available from energy monitoring with 15-minute interval data and column headings, in .CSV and/or API?",null,"dataFileConcat","concat 226:248",null,null,null,null,null,null,{"$f":"IF(IF(ISNA(INDEX('Application V2'!A:M, MATCH(Application.!A225,'Application V2'!A:A,0),12)), \"\", INDEX('Application V2'!A:M, MATCH(Application.!A225,'Application V2'!A:A,0),12))=0, \"\", IF(ISNA(INDEX('Application V2'!A:M, MATCH(Application.!A225,'Application V2'!A:A,0),12)), \"\", INDEX('Application V2'!A:M, MATCH(Application.!A225,'Application V2'!A:A,0),12)))","v":""},null,null,null,null,null,null,null,"dataFileConcat"]
[207,226,"  ","i ","   "," e",null,"Interval Data","blank",null,null,null,"Select all that apply",null,null,null,{"$f":"IF(IF(ISNA(INDEX('Application V2'!A:M, MATCH(Application.!A226,'Application V2'!A:A,0),12)), \"\", INDEX('Application V2'!A:M, MATCH(Application.!A226,'Application V2'!A:A,0),12))=0, \"\", IF(ISNA(INDEX('Application V2'!A:M, MATCH(Application.!A226,'Application V2'!A:A,0),12)), \"\", INDEX('Application V2'!A:M, MATCH(Application.!A226,'Application V2'!A:A,0),12)))","v":""},null,null,null,null,null,null,null,"blank"]
[208,227,null,"i ","   "," e",null,"Event-based state-change timestamp","dataApiTimeStampStateChange","boolean",null,null,null,null,false,{"$f":"IF(O227=TRUE,\"Yes\", \"No\")","v":"No"},null,null,null,null,null,null,null,null,"dataApiTimeStampStateChange"]
[209,228,null,"i ","   "," e",null,"Regularly spaced timestamp","dataApiTimeStampRegularIntervals","boolean",null,null,null,null,false,{"$f":"IF(O228=TRUE,\"Yes\", \"No\")","v":"No"},null,null,null,null,null,null,null,null,"dataApiTimeStampRegularIntervals"]
[210,229,"  ","i ","   "," e",null,"    Energy ","    dataFileMeasurementKindEnergy ","boolean",null,null,null,null,false,{"$f":"IF(O229=TRUE,\"Yes\", \"No\")","v":"No"},{"$f":"IF(IF(ISNA(INDEX('Application V2'!A:M, MATCH(Application.!A229,'Application V2'!A:A,0),12)), \"\", INDEX('Application V2'!A:M, MATCH(Application.!A229,'Application V2'!A:A,0),12))=0, \"\", IF(ISNA(INDEX('Application V2'!A:M, MATCH(Application.!A229,'Application V2'!A:A,0),12)), \"\", INDEX('Application V2'!A:M, MATCH(Application.!A229,'Application V2'!A:A,0),12)))","v":""},null,null,null,null,null,null,null,"    dataFileMeasurementKindEnergy "]
[211,230,"  ","i ","   "," e",null,"    Luminaire % light output","    dataFileLuminaireOutput","boolean",null,null,null,null,false,"No",{"$f":"IF(IF(ISNA(INDEX('Application V2'!A:M, MATCH(Application.!A230,'Application V2'!A:A,0),12)), \"\", INDEX('Application V2'!A:M, MATCH(Application.!A230,'Application V2'!A:A,0),12))=0, \"\", IF(ISNA(INDEX('Application V2'!A:M, MATCH(Application.!A230,'Application V2'!A:A,0),12)), \"\", INDEX('Application V2'!A:M, MATCH(Application.!A230,'Application V2'!A:A,0),12)))","v":""},null,null,null,null,null,null,null,"    dataFileLuminaireOutput"]
[212,231,"  ","i ","   "," e",null,"    Luminaire % power","    dataFileLuminairePower","boolean",null,null,null,null,false,"No",{"$f":"IF(IF(ISNA(INDEX('Application V2'!A:M, MATCH(Application.!A231,'Application V2'!A:A,0),12)), \"\", INDEX('Application V2'!A:M, MATCH(Application.!A231,'Application V2'!A:A,0),12))=0, \"\", IF(ISNA(INDEX('Application V2'!A:M, MATCH(Application.!A231,'Application V2'!A:A,0),12)), \"\", INDEX('Application V2'!A:M, MATCH(Application.!A231,'Application V2'!A:A,0),12)))","v":""},null,null,null,null,null,null,null,"    dataFileLuminairePower"]
[213,232,"  ","i ","   "," e",null,"    Occupancy","    dataFileOccupancy","boolean",null,null,null,null,false,"No",{"$f":"IF(IF(ISNA(INDEX('Application V2'!A:M, MATCH(Application.!A232,'Application V2'!A:A,0),12)), \"\", INDEX('Application V2'!A:M, MATCH(Application.!A232,'Application V2'!A:A,0),12))=0, \"\", IF(ISNA(INDEX('Application V2'!A:M, MATCH(Application.!A232,'Application V2'!A:A,0),12)), \"\", INDEX('Application V2'!A:M, MATCH(Application.!A232,'Application V2'!A:A,0),12)))","v":""},null,null,null,null,null,null,null,"    dataFileOccupancy"]
[214,233,"  ","i ","   "," e",null,"    Photosensor Reported Light Level ","    dataFilePhotosensor ","boolean",null,null,null,null,false,"No",{"$f":"IF(IF(ISNA(INDEX('Application V2'!A:M, MATCH(Application.!A233,'Application V2'!A:A,0),12)), \"\", INDEX('Application V2'!A:M, MATCH(Application.!A233,'Application V2'!A:A,0),12))=0, \"\", IF(ISNA(INDEX('Application V2'!A:M, MATCH(Application.!A233,'Application V2'!A:A,0),12)), \"\", INDEX('Application V2'!A:M, MATCH(Application.!A233,'Application V2'!A:A,0),12)))","v":""},null,null,null,null,null,null,null,"    dataFilePhotosensor "]
[215,234,"  ","i ","   "," e",null,"    Peak Power","    dataFileMeasurementKindPeakPower","boolean",null,null,null,null,false,"No",{"$f":"IF(IF(ISNA(INDEX('Application V2'!A:M, MATCH(Application.!A234,'Application V2'!A:A,0),12)), \"\", INDEX('Application V2'!A:M, MATCH(Application.!A234,'Application V2'!A:A,0),12))=0, \"\", IF(ISNA(INDEX('Application V2'!A:M, MATCH(Application.!A234,'Application V2'!A:A,0),12)), \"\", INDEX('Application V2'!A:M, MATCH(Application.!A234,'Application V2'!A:A,0),12)))","v":""},null,null,null,null,null,null,null,"    dataFileMeasurementKindPeakPower"]
[216,235,"  ","i ","   "," e",null,"    THD (Total Harmonic Distortion)","        dataFileMeasurementKindTHD","boolean",null,null,null,null,false,"No",{"$f":"IF(IF(ISNA(INDEX('Application V2'!A:M, MATCH(Application.!A235,'Application V2'!A:A,0),12)), \"\", INDEX('Application V2'!A:M, MATCH(Application.!A235,'Application V2'!A:A,0),12))=0, \"\", IF(ISNA(INDEX('Application V2'!A:M, MATCH(Application.!A235,'Application V2'!A:A,0),12)), \"\", INDEX('Application V2'!A:M, MATCH(Application.!A235,'Application V2'!A:A,0),12)))","v":""},null,null,null,null,null,null,null,"        dataFileMeasurementKindTHD"]
[217,236,null,"i ","   "," e",null,"Energy (kWh) Savings","dataFileEnergySavings","boolean",null,null,null,null,false,"No",{"$f":"IF(IF(ISNA(INDEX('Application V2'!A:M, MATCH(Application.!A236,'Application V2'!A:A,0),12)), \"\", INDEX('Application V2'!A:M, MATCH(Application.!A236,'Application V2'!A:A,0),12))=0, \"\", IF(ISNA(INDEX('Application V2'!A:M, MATCH(Application.!A236,'Application V2'!A:A,0),12)), \"\", INDEX('Application V2'!A:M, MATCH(Application.!A236,'Application V2'!A:A,0),12)))","v":""},null,null,null,null,null,null,null,"dataFileEnergySavings"]
[218,237,null,"i ",null," e",null,"    Other (explain)","dataFileOtherIntervalText","text",null,null,null,null,null,{"$f":"M237","v":0},{"$f":"IF(IF(ISNA(INDEX('Application V2'!A:M, MATCH(Application.!A237,'Application V2'!A:A,0),12)), \"\", INDEX('Application V2'!A:M, MATCH(Application.!A237,'Application V2'!A:A,0),12))=0, \"\", IF(ISNA(INDEX('Application V2'!A:M, MATCH(Application.!A237,'Application V2'!A:A,0),12)), \"\", INDEX('Application V2'!A:M, MATCH(Application.!A237,'Application V2'!A:A,0),12)))","v":""},null,null,null,null,null,null,null,"dataFileOtherIntervalText"]
[219,238,"  ","i ","   "," e",null,"Application Data","blank",null,null,null,"Select all that apply",null,null,null,{"$f":"IF(IF(ISNA(INDEX('Application V2'!A:M, MATCH(Application.!A238,'Application V2'!A:A,0),12)), \"\", INDEX('Application V2'!A:M, MATCH(Application.!A238,'Application V2'!A:A,0),12))=0, \"\", IF(ISNA(INDEX('Application V2'!A:M, MATCH(Application.!A238,'Application V2'!A:A,0),12)), \"\", INDEX('Application V2'!A:M, MATCH(Application.!A238,'Application V2'!A:A,0),12)))","v":""},null,null,null,null,null,null,null,"blank"]
[220,239,null,"i ","   "," e",null,"NLC Manufacturer ","dataFileOEM","boolean",null,null,null,null,false,{"$f":"IF(O239=TRUE,\"Yes\", \"No\")","v":"No"},null,null,null,null,null,null,null,null,"dataFileOEM"]
[221,240,null,"i ","   "," e",null,"NLC Product ","dataFileProduct","boolean",null,null,null,null,false,"No",null,null,null,null,null,null,null,null,"dataFileProduct"]
[222,241,"  ","i ","   "," e",null,"    Building size (ft^2)","    dataFileBuildingSizeSf","boolean",null,null,null,null,false,"No",{"$f":"IF(IF(ISNA(INDEX('Application V2'!A:M, MATCH(Application.!A241,'Application V2'!A:A,0),12)), \"\", INDEX('Application V2'!A:M, MATCH(Application.!A241,'Application V2'!A:A,0),12))=0, \"\", IF(ISNA(INDEX('Application V2'!A:M, MATCH(Application.!A241,'Application V2'!A:A,0),12)), \"\", INDEX('Application V2'!A:M, MATCH(Application.!A241,'Application V2'!A:A,0),12)))","v":""},null,null,null,null,null,null,null,"    dataFileBuildingSizeSf"]
[223,242,"  ","i ","   "," e",null,"    Building type (e.g. warehouse, school, office...)","    dataFileBuildingType","boolean",null,null,null,null,false,"No",{"$f":"IF(IF(ISNA(INDEX('Application V2'!A:M, MATCH(Application.!A242,'Application V2'!A:A,0),12)), \"\", INDEX('Application V2'!A:M, MATCH(Application.!A242,'Application V2'!A:A,0),12))=0, \"\", IF(ISNA(INDEX('Application V2'!A:M, MATCH(Application.!A242,'Application V2'!A:A,0),12)), \"\", INDEX('Application V2'!A:M, MATCH(Application.!A242,'Application V2'!A:A,0),12)))","v":""},null,null,null,null,null,null,null,"    dataFileBuildingType"]
[224,243,"  ","i ","   "," e",null,"    Luminaire type ","    dataFileLuminaireType ","boolean",null,null,null,null,false,"No",{"$f":"IF(IF(ISNA(INDEX('Application V2'!A:M, MATCH(Application.!A243,'Application V2'!A:A,0),12)), \"\", INDEX('Application V2'!A:M, MATCH(Application.!A243,'Application V2'!A:A,0),12))=0, \"\", IF(ISNA(INDEX('Application V2'!A:M, MATCH(Application.!A243,'Application V2'!A:A,0),12)), \"\", INDEX('Application V2'!A:M, MATCH(Application.!A243,'Application V2'!A:A,0),12)))","v":""},null,null,null,null,null,null,null,"    dataFileLuminaireType "]
[225,244,"  ","i ","   "," e",null,"    Luminaire wattage (new)","    dataFileLuminaireWattageNew","boolean",null,null,null,null,false,"No",{"$f":"IF(IF(ISNA(INDEX('Application V2'!A:M, MATCH(Application.!A244,'Application V2'!A:A,0),12)), \"\", INDEX('Application V2'!A:M, MATCH(Application.!A244,'Application V2'!A:A,0),12))=0, \"\", IF(ISNA(INDEX('Application V2'!A:M, MATCH(Application.!A244,'Application V2'!A:A,0),12)), \"\", INDEX('Application V2'!A:M, MATCH(Application.!A244,'Application V2'!A:A,0),12)))","v":""},null,null,null,null,null,null,null,"    dataFileLuminaireWattageNew"]
[226,245,"  ","i ","   "," e",null,"    Space type (e.g. corridor, conference room, bathroom…)","    dataFileSpaceType","boolean",null,null,null,null,false,"No",{"$f":"IF(IF(ISNA(INDEX('Application V2'!A:M, MATCH(Application.!A245,'Application V2'!A:A,0),12)), \"\", INDEX('Application V2'!A:M, MATCH(Application.!A245,'Application V2'!A:A,0),12))=0, \"\", IF(ISNA(INDEX('Application V2'!A:M, MATCH(Application.!A245,'Application V2'!A:A,0),12)), \"\", INDEX('Application V2'!A:M, MATCH(Application.!A245,'Application V2'!A:A,0),12)))","v":""},null,null,null,null,null,null,null,"    dataFileSpaceType"]
[227,246,"  ","i ","   "," e",null,"    State or Province","    dataFileStateProvince","boolean",null,null,null,null,false,"No",{"$f":"IF(IF(ISNA(INDEX('Application V2'!A:M, MATCH(Application.!A246,'Application V2'!A:A,0),12)), \"\", INDEX('Application V2'!A:M, MATCH(Application.!A246,'Application V2'!A:A,0),12))=0, \"\", IF(ISNA(INDEX('Application V2'!A:M, MATCH(Application.!A246,'Application V2'!A:A,0),12)), \"\", INDEX('Application V2'!A:M, MATCH(Application.!A246,'Application V2'!A:A,0),12)))","v":""},null,null,null,null,null,null,null,"    dataFileStateProvince"]
[228,247,"  ","i ","   "," e",null,"High End Trim Setting","dataFileHighEndTrim","boolean",null,null,null,null,null,"No",null,null,null,null,null,null,null,null,"dataFileHighEndTrim"]
[229,248,"  ","i ","   "," e",null,"    Other (explain)","    dataFileOtherApplicationText","text",null,null,null,null,null,{"$f":"IF(ISBLANK(M248),\"\",M248)","v":""},{"$f":"IF(IF(ISNA(INDEX('Application V2'!A:M, MATCH(Application.!A248,'Application V2'!A:A,0),12)), \"\", INDEX('Application V2'!A:M, MATCH(Application.!A248,'Application V2'!A:A,0),12))=0, \"\", IF(ISNA(INDEX('Application V2'!A:M, MATCH(Application.!A248,'Application V2'!A:A,0),12)), \"\", INDEX('Application V2'!A:M, MATCH(Application.!A248,'Application V2'!A:A,0),12)))","v":""},null,null,null,null,null,null,null,"    dataFileOtherApplicationText"]
[230,249,"I ","  ","E",null,"Is this data available in a .CSV file and/or API?  (Choose from dropdown menu)",null,"dataFileFormatEM1CsvApi","text",null,null,null,null,null,{"$f":"IF(ISBLANK(M249),\"\",M249)","v":""},{"$f":"IF(IF(ISNA(INDEX('Application V2'!A:M, MATCH(Application.!A249,'Application V2'!A:A,0),12)), \"\", INDEX('Application V2'!A:M, MATCH(Application.!A249,'Application V2'!A:A,0),12))=0, \"\", IF(ISNA(INDEX('Application V2'!A:M, MATCH(Application.!A249,'Application V2'!A:A,0),12)), \"\", INDEX('Application V2'!A:M, MATCH(Application.!A249,'Application V2'!A:A,0),12)))","v":""},null,null,null,null,null,null,null,"dataFileFormatEM1CsvApi"]
[231,250,"  ","i ","   "," e","What data format standard is supported?",null,"emDataStandardConcat","concat 251:255"]
[231.1,251,null,"i ","   "," e",null,"TALQ","dataTALQ","boolean",null,null,null,null,false,{"$f":"IF(O251=TRUE,\"Yes\", \"No\")","v":"No"}]
[231.2,252,null,"i ","   "," e",null,"TALQ2","dataTALQ2","boolean",null,null,null,null,false,"No"]
[231.3,253,null,"i ","   "," e",null,"LMI","dataLMI","boolean",null,null,null,null,false,"No"]
[231.4,254,null,"i ","   "," e",null,"ANSI","dataANSI","boolean",null,null,null,null,false,"No"]
[231.5,255,null,"i ","   "," e",null,"Other (explain)","dataOther","text",null,null,null,null,null,{"$f":"IF(ISBLANK(M255),\"\",M255)","v":""}]
[232,256,"   \n ","i  \n ","    \n "," e \n ","Does your customer contract offer a clause making energy data available to support energy efficiency rebates and incentives?",null,"dataFileContractRebates","boolean",null,null,null,null,false,{"$f":"IF(O256=TRUE,\"Yes\", \"No\")","v":"No"},{"$f":"IF(IF(ISNA(INDEX('Application V2'!A:M, MATCH(Application.!A256,'Application V2'!A:A,0),12)), \"\", INDEX('Application V2'!A:M, MATCH(Application.!A256,'Application V2'!A:A,0),12))=0, \"\", IF(ISNA(INDEX('Application V2'!A:M, MATCH(Application.!A256,'Application V2'!A:A,0),12)), \"\", INDEX('Application V2'!A:M, MATCH(Application.!A256,'Application V2'!A:A,0),12)))","v":""},null,null,null,null,null,null,null,"dataFileContractRebates"]
[233,257,"   \n ","i  \n ","    \n "," e \n ","Does your customer contract offer a clause making anonymized energy data available for research on energy savings?",null,"dataFileContractResearch","boolean",null,null,null,null,false,{"$f":"IF(O257=TRUE,\"Yes\", \"No\")","v":"No"},{"$f":"IF(IF(ISNA(INDEX('Application V2'!A:M, MATCH(Application.!A257,'Application V2'!A:A,0),12)), \"\", INDEX('Application V2'!A:M, MATCH(Application.!A257,'Application V2'!A:A,0),12))=0, \"\", IF(ISNA(INDEX('Application V2'!A:M, MATCH(Application.!A257,'Application V2'!A:A,0),12)), \"\", INDEX('Application V2'!A:M, MATCH(Application.!A257,'Application V2'!A:A,0),12)))","v":""},null,null,null,null,null,null,null,"dataFileContractResearch"]
[234,258,"I ","  ","E",null,"11)","Energy Monitoring","blank",null,null,null,null,null,null,null,{"$f":"IF(IF(ISNA(INDEX('Application V2'!A:M, MATCH(Application.!A258,'Application V2'!A:A,0),12)), \"\", INDEX('Application V2'!A:M, MATCH(Application.!A258,'Application V2'!A:A,0),12))=0, \"\", IF(ISNA(INDEX('Application V2'!A:M, MATCH(Application.!A258,'Application V2'!A:A,0),12)), \"\", INDEX('Application V2'!A:M, MATCH(Application.!A258,'Application V2'!A:A,0),12)))","v":""},null,null,null,null,null,null,null,"blank"]
[235,259,"  ","i ","   "," e","12)","Device Monitoring / Remote Diagnostics","blank",null,null,null,null,null,null,null,{"$f":"IF(IF(ISNA(INDEX('Application V2'!A:M, MATCH(Application.!A259,'Application V2'!A:A,0),12)), \"\", INDEX('Application V2'!A:M, MATCH(Application.!A259,'Application V2'!A:A,0),12))=0, \"\", IF(ISNA(INDEX('Application V2'!A:M, MATCH(Application.!A259,'Application V2'!A:A,0),12)), \"\", INDEX('Application V2'!A:M, MATCH(Application.!A259,'Application V2'!A:A,0),12)))","v":""},null,null,null,null,null,null,null,"blank"]
[236,260," \n \n \n"," \n \n \n"," \n \n \n"," \n \n \n","Definition:  The capability to monitor, diagnose, and report operational performance including system and/or component failures.  ",null,"blank",null,null,null,null,null,null,null,{"$f":"IF(IF(ISNA(INDEX('Application V2'!A:M, MATCH(Application.!A260,'Application V2'!A:A,0),12)), \"\", INDEX('Application V2'!A:M, MATCH(Application.!A260,'Application V2'!A:A,0),12))=0, \"\", IF(ISNA(INDEX('Application V2'!A:M, MATCH(Application.!A260,'Application V2'!A:A,0),12)), \"\", INDEX('Application V2'!A:M, MATCH(Application.!A260,'Application V2'!A:A,0),12)))","v":""},null,null,null,null,null,null,null,"blank"]
[237,261,"  \n ","i \n ","   \n "," e\n ","Does the system have Device Monitoring/Remote Diagnostics capability, with instructions for how to configure and/or use this feature?",null,"hasDiag","boolean",null,null,null,null,false,{"$f":"IF(O261=TRUE,\"Yes\", \"No\")","v":"No"},{"$f":"IF(IF(ISNA(INDEX('Application V2'!A:M, MATCH(Application.!A261,'Application V2'!A:A,0),12)), \"\", INDEX('Application V2'!A:M, MATCH(Application.!A261,'Application V2'!A:A,0),12))=0, \"\", IF(ISNA(INDEX('Application V2'!A:M, MATCH(Application.!A261,'Application V2'!A:A,0),12)), \"\", INDEX('Application V2'!A:M, MATCH(Application.!A261,'Application V2'!A:A,0),12)))","v":""},null,null,null,null,null,null,null,"hasDiag"]
[238,262,"  \n ","i \n ","   \n "," e","What system characteristics can be monitored, diagnosed, and/or reported? ",null,"diagWhatConcat","concat 263:271",null,null,"Select all that apply",null,null,null,{"$f":"IF(IF(ISNA(INDEX('Application V2'!A:M, MATCH(Application.!A262,'Application V2'!A:A,0),12)), \"\", INDEX('Application V2'!A:M, MATCH(Application.!A262,'Application V2'!A:A,0),12))=0, \"\", IF(ISNA(INDEX('Application V2'!A:M, MATCH(Application.!A262,'Application V2'!A:A,0),12)), \"\", INDEX('Application V2'!A:M, MATCH(Application.!A262,'Application V2'!A:A,0),12)))","v":""},null,null,null,null,null,null,null,"diagWhatConcat"]
[239,263,"  ","i ","   "," e",null,"Battery Level","diagWhatBattery","boolean",null,null,null,null,false,{"$f":"IF(O263=TRUE,\"Yes\", \"No\")","v":"No"},{"$f":"IF(IF(ISNA(INDEX('Application V2'!A:M, MATCH(Application.!A263,'Application V2'!A:A,0),12)), \"\", INDEX('Application V2'!A:M, MATCH(Application.!A263,'Application V2'!A:A,0),12))=0, \"\", IF(ISNA(INDEX('Application V2'!A:M, MATCH(Application.!A263,'Application V2'!A:A,0),12)), \"\", INDEX('Application V2'!A:M, MATCH(Application.!A263,'Application V2'!A:A,0),12)))","v":""},null,null,null,null,null,null,null,"diagWhatBattery"]
[240,264,"  ","i ","   "," e",null,"Communication Issues","diagWhatCommFault","boolean",null,null,null,null,false,"No",{"$f":"IF(IF(ISNA(INDEX('Application V2'!A:M, MATCH(Application.!A264,'Application V2'!A:A,0),12)), \"\", INDEX('Application V2'!A:M, MATCH(Application.!A264,'Application V2'!A:A,0),12))=0, \"\", IF(ISNA(INDEX('Application V2'!A:M, MATCH(Application.!A264,'Application V2'!A:A,0),12)), \"\", INDEX('Application V2'!A:M, MATCH(Application.!A264,'Application V2'!A:A,0),12)))","v":""},null,null,null,null,null,null,null,"diagWhatCommFault"]
[241,265,"  ","i ","   "," e",null,"Network Latency","diagWhatNetworkLatency","boolean",null,null,null,null,false,"No",{"$f":"IF(IF(ISNA(INDEX('Application V2'!A:M, MATCH(Application.!A265,'Application V2'!A:A,0),12)), \"\", INDEX('Application V2'!A:M, MATCH(Application.!A265,'Application V2'!A:A,0),12))=0, \"\", IF(ISNA(INDEX('Application V2'!A:M, MATCH(Application.!A265,'Application V2'!A:A,0),12)), \"\", INDEX('Application V2'!A:M, MATCH(Application.!A265,'Application V2'!A:A,0),12)))","v":""},null,null,null,null,null,null,null,"diagWhatNetworkLatency"]
[242,266,"  ","i ","   "," e",null,"Network Signal Strength","diagWhatNetworkSignal","boolean",null,null,null,null,false,"No",{"$f":"IF(IF(ISNA(INDEX('Application V2'!A:M, MATCH(Application.!A266,'Application V2'!A:A,0),12)), \"\", INDEX('Application V2'!A:M, MATCH(Application.!A266,'Application V2'!A:A,0),12))=0, \"\", IF(ISNA(INDEX('Application V2'!A:M, MATCH(Application.!A266,'Application V2'!A:A,0),12)), \"\", INDEX('Application V2'!A:M, MATCH(Application.!A266,'Application V2'!A:A,0),12)))","v":""},null,null,null,null,null,null,null,"diagWhatNetworkSignal"]
[243,267,"  ","i ","   "," e",null,"Status: online/offline devices","diagWhatDeviceOnline","boolean",null,null,null,null,false,"No",{"$f":"IF(IF(ISNA(INDEX('Application V2'!A:M, MATCH(Application.!A267,'Application V2'!A:A,0),12)), \"\", INDEX('Application V2'!A:M, MATCH(Application.!A267,'Application V2'!A:A,0),12))=0, \"\", IF(ISNA(INDEX('Application V2'!A:M, MATCH(Application.!A267,'Application V2'!A:A,0),12)), \"\", INDEX('Application V2'!A:M, MATCH(Application.!A267,'Application V2'!A:A,0),12)))","v":""},null,null,null,null,null,null,null,"diagWhatDeviceOnline"]
[244,268,"  ","i ","   "," e",null,"Device errors","diagWhatDeviceErrors","boolean",null,null,null,null,false,"No",{"$f":"IF(IF(ISNA(INDEX('Application V2'!A:M, MATCH(Application.!A268,'Application V2'!A:A,0),12)), \"\", INDEX('Application V2'!A:M, MATCH(Application.!A268,'Application V2'!A:A,0),12))=0, \"\", IF(ISNA(INDEX('Application V2'!A:M, MATCH(Application.!A268,'Application V2'!A:A,0),12)), \"\", INDEX('Application V2'!A:M, MATCH(Application.!A268,'Application V2'!A:A,0),12)))","v":""},null,null,null,null,null,null,null,"diagWhatDeviceErrors"]
[245,269,"  ","i ","   "," e",null,"Component failures","diagWhatComponentFail","boolean",null,null,null,null,false,"No",{"$f":"IF(IF(ISNA(INDEX('Application V2'!A:M, MATCH(Application.!A269,'Application V2'!A:A,0),12)), \"\", INDEX('Application V2'!A:M, MATCH(Application.!A269,'Application V2'!A:A,0),12))=0, \"\", IF(ISNA(INDEX('Application V2'!A:M, MATCH(Application.!A269,'Application V2'!A:A,0),12)), \"\", INDEX('Application V2'!A:M, MATCH(Application.!A269,'Application V2'!A:A,0),12)))","v":""},null,null,null,null,null,null,null,"diagWhatComponentFail"]
[246,270,"  ","i ","   "," e",null,"Remaining component life","diagWhatComponentLife","boolean",null,null,null,null,false,"No",{"$f":"IF(IF(ISNA(INDEX('Application V2'!A:M, MATCH(Application.!A270,'Application V2'!A:A,0),12)), \"\", INDEX('Application V2'!A:M, MATCH(Application.!A270,'Application V2'!A:A,0),12))=0, \"\", IF(ISNA(INDEX('Application V2'!A:M, MATCH(Application.!A270,'Application V2'!A:A,0),12)), \"\", INDEX('Application V2'!A:M, MATCH(Application.!A270,'Application V2'!A:A,0),12)))","v":""},null,null,null,null,null,null,null,"diagWhatComponentLife"]
[247,271,"  ","i ","   "," e",null,"Other","diagWhatOther","text",null,null,null,null,null,{"$f":"IF(ISBLANK(M271),\"\",M271)","v":""},{"$f":"IF(IF(ISNA(INDEX('Application V2'!A:M, MATCH(Application.!A271,'Application V2'!A:A,0),12)), \"\", INDEX('Application V2'!A:M, MATCH(Application.!A271,'Application V2'!A:A,0),12))=0, \"\", IF(ISNA(INDEX('Application V2'!A:M, MATCH(Application.!A271,'Application V2'!A:A,0),12)), \"\", INDEX('Application V2'!A:M, MATCH(Application.!A271,'Application V2'!A:A,0),12)))","v":""},null,null,null,null,null,null,null,"diagWhatOther"]
[248,272,null,"i ",null," e","What mechanisms are provided to alert system problems or failures?  ",null,"diagHowConcat","concat 273:282",null,null,"Select all that apply",null,null,null,{"$f":"IF(IF(ISNA(INDEX('Application V2'!A:M, MATCH(Application.!A272,'Application V2'!A:A,0),12)), \"\", INDEX('Application V2'!A:M, MATCH(Application.!A272,'Application V2'!A:A,0),12))=0, \"\", IF(ISNA(INDEX('Application V2'!A:M, MATCH(Application.!A272,'Application V2'!A:A,0),12)), \"\", INDEX('Application V2'!A:M, MATCH(Application.!A272,'Application V2'!A:A,0),12)))","v":""},null,null,null,null,null,null,null,"diagHowConcat"]
[249,273,"  ","i ","   "," e",null,"Blinking LED luminaire","diagHowBlinkLuminaire","boolean",null,null,null,null,false,{"$f":"IF(O273=TRUE,\"Yes\", \"No\")","v":"No"},{"$f":"IF(IF(ISNA(INDEX('Application V2'!A:M, MATCH(Application.!A273,'Application V2'!A:A,0),12)), \"\", INDEX('Application V2'!A:M, MATCH(Application.!A273,'Application V2'!A:A,0),12))=0, \"\", IF(ISNA(INDEX('Application V2'!A:M, MATCH(Application.!A273,'Application V2'!A:A,0),12)), \"\", INDEX('Application V2'!A:M, MATCH(Application.!A273,'Application V2'!A:A,0),12)))","v":""},null,null,null,null,null,null,null,"diagHowBlinkLuminaire"]
[250,274,"  ","i ","   "," e",null,"Blinking local LED status lights","diagHowLedStatus","boolean",null,null,null,null,false,"No",{"$f":"IF(IF(ISNA(INDEX('Application V2'!A:M, MATCH(Application.!A274,'Application V2'!A:A,0),12)), \"\", INDEX('Application V2'!A:M, MATCH(Application.!A274,'Application V2'!A:A,0),12))=0, \"\", IF(ISNA(INDEX('Application V2'!A:M, MATCH(Application.!A274,'Application V2'!A:A,0),12)), \"\", INDEX('Application V2'!A:M, MATCH(Application.!A274,'Application V2'!A:A,0),12)))","v":""},null,null,null,null,null,null,null,"diagHowLedStatus"]
[251,275,"  ","i ","   "," e",null,"Email notifications","diagHowEmail","boolean",null,null,null,null,false,"No",{"$f":"IF(IF(ISNA(INDEX('Application V2'!A:M, MATCH(Application.!A275,'Application V2'!A:A,0),12)), \"\", INDEX('Application V2'!A:M, MATCH(Application.!A275,'Application V2'!A:A,0),12))=0, \"\", IF(ISNA(INDEX('Application V2'!A:M, MATCH(Application.!A275,'Application V2'!A:A,0),12)), \"\", INDEX('Application V2'!A:M, MATCH(Application.!A275,'Application V2'!A:A,0),12)))","v":""},null,null,null,null,null,null,null,"diagHowEmail"]
[252,276,"  ","i ","   "," e",null,"GUI alerts","diagHowGuiAlert","boolean",null,null,null,null,false,"No",{"$f":"IF(IF(ISNA(INDEX('Application V2'!A:M, MATCH(Application.!A276,'Application V2'!A:A,0),12)), \"\", INDEX('Application V2'!A:M, MATCH(Application.!A276,'Application V2'!A:A,0),12))=0, \"\", IF(ISNA(INDEX('Application V2'!A:M, MATCH(Application.!A276,'Application V2'!A:A,0),12)), \"\", INDEX('Application V2'!A:M, MATCH(Application.!A276,'Application V2'!A:A,0),12)))","v":""},null,null,null,null,null,null,null,"diagHowGuiAlert"]
[253,277,"  ","i ","   "," e",null,"GUI map of offline devices","diagHowGuiMapOnline","boolean",null,null,null,null,false,"No",{"$f":"IF(IF(ISNA(INDEX('Application V2'!A:M, MATCH(Application.!A277,'Application V2'!A:A,0),12)), \"\", INDEX('Application V2'!A:M, MATCH(Application.!A277,'Application V2'!A:A,0),12))=0, \"\", IF(ISNA(INDEX('Application V2'!A:M, MATCH(Application.!A277,'Application V2'!A:A,0),12)), \"\", INDEX('Application V2'!A:M, MATCH(Application.!A277,'Application V2'!A:A,0),12)))","v":""},null,null,null,null,null,null,null,"diagHowGuiMapOnline"]
[254,278,"  ","i ","   "," e",null,"GUI page","diagHowGui","boolean",null,null,null,null,false,"No",{"$f":"IF(IF(ISNA(INDEX('Application V2'!A:M, MATCH(Application.!A278,'Application V2'!A:A,0),12)), \"\", INDEX('Application V2'!A:M, MATCH(Application.!A278,'Application V2'!A:A,0),12))=0, \"\", IF(ISNA(INDEX('Application V2'!A:M, MATCH(Application.!A278,'Application V2'!A:A,0),12)), \"\", INDEX('Application V2'!A:M, MATCH(Application.!A278,'Application V2'!A:A,0),12)))","v":""},null,null,null,null,null,null,null,"diagHowGui"]
[255,279,"  ","i ","   "," e",null,"Outage reports","diagHowReport","boolean",null,null,null,null,false,"No",{"$f":"IF(IF(ISNA(INDEX('Application V2'!A:M, MATCH(Application.!A279,'Application V2'!A:A,0),12)), \"\", INDEX('Application V2'!A:M, MATCH(Application.!A279,'Application V2'!A:A,0),12))=0, \"\", IF(ISNA(INDEX('Application V2'!A:M, MATCH(Application.!A279,'Application V2'!A:A,0),12)), \"\", INDEX('Application V2'!A:M, MATCH(Application.!A279,'Application V2'!A:A,0),12)))","v":""},null,null,null,null,null,null,null,"diagHowReport"]
[255.1,280,null,"i",null,"e",null,"API alarms","diagHowApi","boolean",null,null,null,null,false,"No"]
[255.2,281,null,"i",null,"e",null,"BACnet alarms","diagHowBacnet","boolean",null,null,null,null,false,"No"]
[256,282,"  ","i ","   "," e",null,"Other","diagHowOther","text",null,null,null,null,null,{"$f":"IF(ISBLANK(M282),\"\",M282)","v":""},{"$f":"IF(IF(ISNA(INDEX('Application V2'!A:M, MATCH(Application.!A282,'Application V2'!A:A,0),12)), \"\", INDEX('Application V2'!A:M, MATCH(Application.!A282,'Application V2'!A:A,0),12))=0, \"\", IF(ISNA(INDEX('Application V2'!A:M, MATCH(Application.!A282,'Application V2'!A:A,0),12)), \"\", INDEX('Application V2'!A:M, MATCH(Application.!A282,'Application V2'!A:A,0),12)))","v":""},null,null,null,null,null,null,null,"diagHowOther"]
[257,283,"  ","i ","   "," e","12)","Device Monitoring / Remote Diagnostics","blank",null,null,null,null,null,null,null,{"$f":"IF(IF(ISNA(INDEX('Application V2'!A:M, MATCH(Application.!A283,'Application V2'!A:A,0),12)), \"\", INDEX('Application V2'!A:M, MATCH(Application.!A283,'Application V2'!A:A,0),12))=0, \"\", IF(ISNA(INDEX('Application V2'!A:M, MATCH(Application.!A283,'Application V2'!A:A,0),12)), \"\", INDEX('Application V2'!A:M, MATCH(Application.!A283,'Application V2'!A:A,0),12)))","v":""},null,null,null,null,null,null,null,"blank"]
[258,284,"  ","i ","   "," e","13)","User Interface","blank",null,null,null,null,null,null,null,{"$f":"IF(IF(ISNA(INDEX('Application V2'!A:M, MATCH(Application.!A284,'Application V2'!A:A,0),12)), \"\", INDEX('Application V2'!A:M, MATCH(Application.!A284,'Application V2'!A:A,0),12))=0, \"\", IF(ISNA(INDEX('Application V2'!A:M, MATCH(Application.!A284,'Application V2'!A:A,0),12)), \"\", INDEX('Application V2'!A:M, MATCH(Application.!A284,'Application V2'!A:A,0),12)))","v":""},null,null,null,null,null,null,null,"blank"]
[259,285," \n \n \n"," \n \n \n"," \n \n \n"," \n \n \n","Definition: The type of interface provided by the control system for users to read and adjust control system settings during system start-up, commissioning, and/or ongoing operation.",null,"hasUI","boolean",null,null,null,null,null,null,{"$f":"IF(IF(ISNA(INDEX('Application V2'!A:M, MATCH(Application.!A285,'Application V2'!A:A,0),12)), \"\", INDEX('Application V2'!A:M, MATCH(Application.!A285,'Application V2'!A:A,0),12))=0, \"\", IF(ISNA(INDEX('Application V2'!A:M, MATCH(Application.!A285,'Application V2'!A:A,0),12)), \"\", INDEX('Application V2'!A:M, MATCH(Application.!A285,'Application V2'!A:A,0),12)))","v":""},null,null,null,null,null,null,null,"hasUI"]
[260,286,"   \n ","i ","    \n "," e","What is the User Interface platform(s)?",null,"uiPlatformConcat","concat 287:297",null,null,"Select all that apply",null,null,null,{"$f":"IF(IF(ISNA(INDEX('Application V2'!A:M, MATCH(Application.!A286,'Application V2'!A:A,0),12)), \"\", INDEX('Application V2'!A:M, MATCH(Application.!A286,'Application V2'!A:A,0),12))=0, \"\", IF(ISNA(INDEX('Application V2'!A:M, MATCH(Application.!A286,'Application V2'!A:A,0),12)), \"\", INDEX('Application V2'!A:M, MATCH(Application.!A286,'Application V2'!A:A,0),12)))","v":""},null,null,null,null,null,null,null,"uiPlatformConcat"]
[261,287,"  ","i ","   "," e",null,"App for Android","uiPlatformAppAndroid","boolean",null,null,null,null,false,{"$f":"IF(O287=TRUE,\"Yes\", \"No\")","v":"No"},{"$f":"IF(IF(ISNA(INDEX('Application V2'!A:M, MATCH(Application.!A287,'Application V2'!A:A,0),12)), \"\", INDEX('Application V2'!A:M, MATCH(Application.!A287,'Application V2'!A:A,0),12))=0, \"\", IF(ISNA(INDEX('Application V2'!A:M, MATCH(Application.!A287,'Application V2'!A:A,0),12)), \"\", INDEX('Application V2'!A:M, MATCH(Application.!A287,'Application V2'!A:A,0),12)))","v":""},null,null,null,null,null,null,null,"uiPlatformAppAndroid"]
[262,288,"  ","i ","   "," e",null,"App for IOS","uiPlatformAppIOS","boolean",null,null,null,null,false,"No",{"$f":"IF(IF(ISNA(INDEX('Application V2'!A:M, MATCH(Application.!A288,'Application V2'!A:A,0),12)), \"\", INDEX('Application V2'!A:M, MATCH(Application.!A288,'Application V2'!A:A,0),12))=0, \"\", IF(ISNA(INDEX('Application V2'!A:M, MATCH(Application.!A288,'Application V2'!A:A,0),12)), \"\", INDEX('Application V2'!A:M, MATCH(Application.!A288,'Application V2'!A:A,0),12)))","v":""},null,null,null,null,null,null,null,"uiPlatformAppIOS"]
[263,289,"  ","i ","   "," e",null,"Wall switch with wireless comm & wireless power","uiPlatformSwitchWirelessWireless","boolean",null,null,null,null,false,{"$f":"IF(O289=TRUE,\"Yes\", \"No\")","v":"No"},{"$f":"IF(IF(ISNA(INDEX('Application V2'!A:M, MATCH(Application.!A289,'Application V2'!A:A,0),12)), \"\", INDEX('Application V2'!A:M, MATCH(Application.!A289,'Application V2'!A:A,0),12))=0, \"\", IF(ISNA(INDEX('Application V2'!A:M, MATCH(Application.!A289,'Application V2'!A:A,0),12)), \"\", INDEX('Application V2'!A:M, MATCH(Application.!A289,'Application V2'!A:A,0),12)))","v":""},null,null,null,null,null,null,null,"uiPlatformSwitchWirelessWireless"]
[264,290,"  ","i ","   "," e",null,"Wall switch with wireless comm & power wired to switch","uiPlatformSwitchWirelessWiredTo","boolean",null,null,null,null,false,"No",{"$f":"IF(IF(ISNA(INDEX('Application V2'!A:M, MATCH(Application.!A290,'Application V2'!A:A,0),12)), \"\", INDEX('Application V2'!A:M, MATCH(Application.!A290,'Application V2'!A:A,0),12))=0, \"\", IF(ISNA(INDEX('Application V2'!A:M, MATCH(Application.!A290,'Application V2'!A:A,0),12)), \"\", INDEX('Application V2'!A:M, MATCH(Application.!A290,'Application V2'!A:A,0),12)))","v":""},null,null,null,null,null,null,null,"uiPlatformSwitchWirelessWiredTo"]
[265,291,"  ","i ","   "," e",null,"Wall switch with wireless comm & power wired thru switch to luminaire(s)","uiPlatformSwitchWirelessWiredThru","boolean",null,null,null,null,false,"No",null,null,null,null,null,null,null,null,"uiPlatformSwitchWirelessWiredThru"]
[266,292,"  ","i ","   "," e",null,"Remote control with display","uiPlatformRemoteDisplay","boolean",null,null,null,null,false,"No",{"$f":"IF(IF(ISNA(INDEX('Application V2'!A:M, MATCH(Application.!A292,'Application V2'!A:A,0),12)), \"\", INDEX('Application V2'!A:M, MATCH(Application.!A292,'Application V2'!A:A,0),12))=0, \"\", IF(ISNA(INDEX('Application V2'!A:M, MATCH(Application.!A292,'Application V2'!A:A,0),12)), \"\", INDEX('Application V2'!A:M, MATCH(Application.!A292,'Application V2'!A:A,0),12)))","v":""},null,null,null,null,null,null,null,"uiPlatformRemoteDisplay"]
[267,293,null,"i ","   "," e",null,"Voice control","uiPlatformVoice","boolean",null,null,null,null,false,"No",{"$f":"IF(IF(ISNA(INDEX('Application V2'!A:M, MATCH(Application.!A293,'Application V2'!A:A,0),12)), \"\", INDEX('Application V2'!A:M, MATCH(Application.!A293,'Application V2'!A:A,0),12))=0, \"\", IF(ISNA(INDEX('Application V2'!A:M, MATCH(Application.!A293,'Application V2'!A:A,0),12)), \"\", INDEX('Application V2'!A:M, MATCH(Application.!A293,'Application V2'!A:A,0),12)))","v":""},null,null,null,null,null,null,null,"uiPlatformVoice"]
[268,294,"  ","i ","   "," e",null,"Wall mounted control panel or touch screen","uiPlatformWallMount","boolean",null,null,null,null,false,"No",{"$f":"IF(IF(ISNA(INDEX('Application V2'!A:M, MATCH(Application.!A294,'Application V2'!A:A,0),12)), \"\", INDEX('Application V2'!A:M, MATCH(Application.!A294,'Application V2'!A:A,0),12))=0, \"\", IF(ISNA(INDEX('Application V2'!A:M, MATCH(Application.!A294,'Application V2'!A:A,0),12)), \"\", INDEX('Application V2'!A:M, MATCH(Application.!A294,'Application V2'!A:A,0),12)))","v":""},null,null,null,null,null,null,null,"uiPlatformWallMount"]
[269,295,"  ","i ","   "," e",null,"Web interface","uiPlatformWeb","boolean",null,null,null,null,false,"No",{"$f":"IF(IF(ISNA(INDEX('Application V2'!A:M, MATCH(Application.!A295,'Application V2'!A:A,0),12)), \"\", INDEX('Application V2'!A:M, MATCH(Application.!A295,'Application V2'!A:A,0),12))=0, \"\", IF(ISNA(INDEX('Application V2'!A:M, MATCH(Application.!A295,'Application V2'!A:A,0),12)), \"\", INDEX('Application V2'!A:M, MATCH(Application.!A295,'Application V2'!A:A,0),12)))","v":""},null,null,null,null,null,null,null,"uiPlatformWeb"]
[270,296,"  ","i ","   "," e",null,"Windows-based software program","uiPlatformWindows","boolean",null,null,null,null,false,"No",{"$f":"IF(IF(ISNA(INDEX('Application V2'!A:M, MATCH(Application.!A296,'Application V2'!A:A,0),12)), \"\", INDEX('Application V2'!A:M, MATCH(Application.!A296,'Application V2'!A:A,0),12))=0, \"\", IF(ISNA(INDEX('Application V2'!A:M, MATCH(Application.!A296,'Application V2'!A:A,0),12)), \"\", INDEX('Application V2'!A:M, MATCH(Application.!A296,'Application V2'!A:A,0),12)))","v":""},null,null,null,null,null,null,null,"uiPlatformWindows"]
[271,297,null,"i ","   "," e",null,"Other (explain)","uiPlatformOther","text",null,null,null,null,null,{"$f":"IF(ISBLANK(M297),\"\",M297)","v":""},{"$f":"IF(IF(ISNA(INDEX('Application V2'!A:M, MATCH(Application.!A297,'Application V2'!A:A,0),12)), \"\", INDEX('Application V2'!A:M, MATCH(Application.!A297,'Application V2'!A:A,0),12))=0, \"\", IF(ISNA(INDEX('Application V2'!A:M, MATCH(Application.!A297,'Application V2'!A:A,0),12)), \"\", INDEX('Application V2'!A:M, MATCH(Application.!A297,'Application V2'!A:A,0),12)))","v":""},null,null,null,null,null,null,null,"uiPlatformOther"]
[272,298,"  ","i ","   "," e","Does the system have the capability to upload a floorplan?",null,"uiFloorplanUpload","boolean",null,null,null,null,false,{"$f":"IF(O298=TRUE,\"Yes\", \"No\")","v":"No"},{"$f":"IF(IF(ISNA(INDEX('Application V2'!A:M, MATCH(Application.!A298,'Application V2'!A:A,0),12)), \"\", INDEX('Application V2'!A:M, MATCH(Application.!A298,'Application V2'!A:A,0),12))=0, \"\", IF(ISNA(INDEX('Application V2'!A:M, MATCH(Application.!A298,'Application V2'!A:A,0),12)), \"\", INDEX('Application V2'!A:M, MATCH(Application.!A298,'Application V2'!A:A,0),12)))","v":""},null,null,null,null,null,null,null,"uiFloorplanUpload"]
[272.10000000000002,299,null,"i",null,"e",null,"Is floorplan and luminaire positioning data exportable via API?","uiFloorplanExportApi","boolean",null,null,null,null,false,"No"]
[273,300,null,"i ","   "," e","Does the system enable the user to place devices on a graphic grid, as a simple substitute for a true floorplan?",null,"uiGrid","boolean",null,null,null,null,false,"No",{"$f":"IF(IF(ISNA(INDEX('Application V2'!A:M, MATCH(Application.!A300,'Application V2'!A:A,0),12)), \"\", INDEX('Application V2'!A:M, MATCH(Application.!A300,'Application V2'!A:A,0),12))=0, \"\", IF(ISNA(INDEX('Application V2'!A:M, MATCH(Application.!A300,'Application V2'!A:A,0),12)), \"\", INDEX('Application V2'!A:M, MATCH(Application.!A300,'Application V2'!A:A,0),12)))","v":""},null,null,null,null,null,null,null,"uiGrid"]
[274,301,null,"i","   "," e","Does the system have the ability to display a GIS-based site plan similar to Google Maps?",null,"uiGisMap","boolean",null,null,null,null,false,"No",{"$f":"IF(IF(ISNA(INDEX('Application V2'!A:M, MATCH(Application.!A301,'Application V2'!A:A,0),12)), \"\", INDEX('Application V2'!A:M, MATCH(Application.!A301,'Application V2'!A:A,0),12))=0, \"\", IF(ISNA(INDEX('Application V2'!A:M, MATCH(Application.!A301,'Application V2'!A:A,0),12)), \"\", INDEX('Application V2'!A:M, MATCH(Application.!A301,'Application V2'!A:A,0),12)))","v":""},null,null,null,null,null,null,null,"uiGisMap"]
[274.10000000000002,302,null,"i",null,"e",null,"Is GIS data exportable via API?","uiGisExportApi","boolean",null,null,null,null,false,"No"]
[274.2,303,null,"i",null,"e",null,"What industry standard format is used for GIS data?","uiGisFormat","text",null,null,null,null,null,{"$f":"IF(ISBLANK(M303),\"\",M303)","v":""}]
[275,304,"   \n ","i  \n ","    \n "," e \n ","Does the system have the capability to modify settings that are displayed on a floorplan?",null,"uiFloorplanMod","boolean",null,null,null,null,false,"No",{"$f":"IF(IF(ISNA(INDEX('Application V2'!A:M, MATCH(Application.!A304,'Application V2'!A:A,0),12)), \"\", INDEX('Application V2'!A:M, MATCH(Application.!A304,'Application V2'!A:A,0),12))=0, \"\", IF(ISNA(INDEX('Application V2'!A:M, MATCH(Application.!A304,'Application V2'!A:A,0),12)), \"\", INDEX('Application V2'!A:M, MATCH(Application.!A304,'Application V2'!A:A,0),12)))","v":""},null,null,null,null,null,null,null,"uiFloorplanMod"]
[276,305,"   \n ","i  \n ","    \n "," e \n ","Does the User Interface utilize two-way communication? (i.e. can it both read settings from the device and adjust settings?)",null,"uiTwoWay","boolean",null,null,null,null,false,"No",{"$f":"IF(IF(ISNA(INDEX('Application V2'!A:M, MATCH(Application.!A305,'Application V2'!A:A,0),12)), \"\", INDEX('Application V2'!A:M, MATCH(Application.!A305,'Application V2'!A:A,0),12))=0, \"\", IF(ISNA(INDEX('Application V2'!A:M, MATCH(Application.!A305,'Application V2'!A:A,0),12)), \"\", INDEX('Application V2'!A:M, MATCH(Application.!A305,'Application V2'!A:A,0),12)))","v":""},null,null,null,null,null,null,null,"uiTwoWay"]
[277,306,"  ","i ","   "," e","Can the User Interface display existing system settings?",null,"uiShowSettings","boolean",null,null,null,null,false,"No",{"$f":"IF(IF(ISNA(INDEX('Application V2'!A:M, MATCH(Application.!A306,'Application V2'!A:A,0),12)), \"\", INDEX('Application V2'!A:M, MATCH(Application.!A306,'Application V2'!A:A,0),12))=0, \"\", IF(ISNA(INDEX('Application V2'!A:M, MATCH(Application.!A306,'Application V2'!A:A,0),12)), \"\", INDEX('Application V2'!A:M, MATCH(Application.!A306,'Application V2'!A:A,0),12)))","v":""},null,null,null,null,null,null,null,"uiShowSettings"]
[278,307,"  ","i ","   "," e","Notes, if needed",null,"uiNotes","text",null,null,null,null,null,{"$f":"IF(ISBLANK(M307),\"\",M307)","v":""},{"$f":"IF(IF(ISNA(INDEX('Application V2'!A:M, MATCH(Application.!A307,'Application V2'!A:A,0),12)), \"\", INDEX('Application V2'!A:M, MATCH(Application.!A307,'Application V2'!A:A,0),12))=0, \"\", IF(ISNA(INDEX('Application V2'!A:M, MATCH(Application.!A307,'Application V2'!A:A,0),12)), \"\", INDEX('Application V2'!A:M, MATCH(Application.!A307,'Application V2'!A:A,0),12)))","v":""},null,null,null,null,null,null,null,"uiNotes"]
[279,308,"  ","i ","   "," e","13)","User Interface","blank",null,null,null,null,null,null,null,{"$f":"IF(IF(ISNA(INDEX('Application V2'!A:M, MATCH(Application.!A308,'Application V2'!A:A,0),12)), \"\", INDEX('Application V2'!A:M, MATCH(Application.!A308,'Application V2'!A:A,0),12))=0, \"\", IF(ISNA(INDEX('Application V2'!A:M, MATCH(Application.!A308,'Application V2'!A:A,0),12)), \"\", INDEX('Application V2'!A:M, MATCH(Application.!A308,'Application V2'!A:A,0),12)))","v":""},null,null,null,null,null,null,null,"blank"]
[280,309,"  ","i ","   ","e","14)","Luminaire Level Lighting Control, Integrated","blank",null,null,null,null,null,null,null,{"$f":"IF(IF(ISNA(INDEX('Application V2'!A:M, MATCH(Application.!A309,'Application V2'!A:A,0),12)), \"\", INDEX('Application V2'!A:M, MATCH(Application.!A309,'Application V2'!A:A,0),12))=0, \"\", IF(ISNA(INDEX('Application V2'!A:M, MATCH(Application.!A309,'Application V2'!A:A,0),12)), \"\", INDEX('Application V2'!A:M, MATCH(Application.!A309,'Application V2'!A:A,0),12)))","v":""},null,null,null,null,null,null,null,"blank"]
[281,310," \n  \n \n \n"," \n  \n \n \n"," \n  \n \n \n"," \n  \n \n \n\n\n\n \n \n\n \n \n","Definition:  The capability to have a networked occupancy sensor and ambient light sensor installed for each luminaire or kit, and directly integrated or embedded into the form factor during the luminaire or kit manufacturing process.  \n\nIn addition to these required integrated components, LLLC systems must have Control Persistence capability as described in this document.  \n\nTo demonstrate commercial availability of the integrated component options, at least one family, luminaire or kit with integrated control must be verified by DLC.  Manufacturers may choose whether or not to list this information publicly on the QPL.  \n",null,"blank",null,null,null,null,null,null,null,{"$f":"IF(IF(ISNA(INDEX('Application V2'!A:M, MATCH(Application.!A310,'Application V2'!A:A,0),12)), \"\", INDEX('Application V2'!A:M, MATCH(Application.!A310,'Application V2'!A:A,0),12))=0, \"\", IF(ISNA(INDEX('Application V2'!A:M, MATCH(Application.!A310,'Application V2'!A:A,0),12)), \"\", INDEX('Application V2'!A:M, MATCH(Application.!A310,'Application V2'!A:A,0),12)))","v":""},null,null,null,null,null,null,null,"blank"]
[282,311,"  \n \n \n","i \n \n \n","   \n \n \n","e","Does the system have the capability to integrate/embed an occupancy sensor, ambient light sensor and networked controller directly into a luminaire and/or kit at the time of manufacture; and also satisfy the Control Persistence capability?",null,"hasLLLC","boolean",null,null,null,null,false,{"$f":"IF(O311=TRUE,\"Yes\", \"No\")","v":"No"},{"$f":"IF(IF(ISNA(INDEX('Application V2'!A:M, MATCH(Application.!A311,'Application V2'!A:A,0),12)), \"\", INDEX('Application V2'!A:M, MATCH(Application.!A311,'Application V2'!A:A,0),12))=0, \"\", IF(ISNA(INDEX('Application V2'!A:M, MATCH(Application.!A311,'Application V2'!A:A,0),12)), \"\", INDEX('Application V2'!A:M, MATCH(Application.!A311,'Application V2'!A:A,0),12)))","v":""},null,null,null,null,null,null,null,"hasLLLC"]
[283,312,"  \n\n \n","i ","   \n\n \n","e","What LLLC luminaires  would you like to display on the DLC QPL?  (Product name(s) or URL(s))",null,"LLLCtextLuminaires","text",null,null,null,null,null,{"$f":"IF(ISBLANK(M312),\"\",M312)","v":""},{"$f":"IF(IF(ISNA(INDEX('Application V2'!A:M, MATCH(Application.!A312,'Application V2'!A:A,0),12)), \"\", INDEX('Application V2'!A:M, MATCH(Application.!A312,'Application V2'!A:A,0),12))=0, \"\", IF(ISNA(INDEX('Application V2'!A:M, MATCH(Application.!A312,'Application V2'!A:A,0),12)), \"\", INDEX('Application V2'!A:M, MATCH(Application.!A312,'Application V2'!A:A,0),12)))","v":""},null,null,null,null,null,null,null,"LLLCtextLuminaires"]
[284,313,null,"i",null,"e","What LLLC kits would you like to display on the DLC QPL?  (Product name(s) or URL(s))",null,"LLLCtextKits","text",null,null,null,null,null,"",null,null,null,null,null,null,null,null,"LLLCtextKits"]
[285,314,null,"i",null,"e",null,"If you choose to claim the LLLC capability, but not to list any luminaires or kits publicly in the row above, what is one example of an LLLC luminaire or kit, that DLC will confirm, but not display on the QPL?","LLLCtextLuminairesPrivate","text",null,null,null,null,null,"",null,null,null,null,null,null,null,null,"LLLCtextLuminairesPrivate"]
[286,315,null,"i",null,"e","Can a third party device \"poll\" the sensor module to access data/status?",null,"LLLCPollSensor","boolean",null,null,null,null,false,{"$f":"IF(O315=TRUE,\"Yes\", \"No\")","v":"No"},null,null,null,null,null,null,null,null,"blank"]
[286.10000000000002,316,null,"i",null,"e","Does the device \"Send on Delta\" based on a user defined rule?",null,"LLLCSendOnDelta","boolean",null,null,null,null,false,{"$f":"IF(O316=TRUE,\"Yes\", \"No\")","v":"No"}]
[287,317,null,"i",null,"e","What communication / wiring protocol is used between the integrated sensor module and the driver?\"",null,"sensorCommConcat","concat  318:324",null,null,null,null,null,null,{"$f":"IF(IF(ISNA(INDEX('Application V2'!A:M, MATCH(Application.!A317,'Application V2'!A:A,0),12)), \"\", INDEX('Application V2'!A:M, MATCH(Application.!A317,'Application V2'!A:A,0),12))=0, \"\", IF(ISNA(INDEX('Application V2'!A:M, MATCH(Application.!A317,'Application V2'!A:A,0),12)), \"\", INDEX('Application V2'!A:M, MATCH(Application.!A317,'Application V2'!A:A,0),12)))","v":""},null,null,null,null,null,null,null,"sensorCommConcat"]
[288,318,null,"i",null,"e",null,"IoT Ready 0-10V analog","sensorCommIotAnalog","boolean",null,null,null,null,false,{"$f":"IF(O318=TRUE,\"Yes\", \"No\")","v":"No"},null,null,null,null,null,null,null,null,"sensorCommIotAnalog"]
[289,319,null,"i",null,"e",null,"IoT Ready RS-232 digital","sensorCommIotDigital","boolean",null,null,null,null,false,{"$f":"IF(O319=TRUE,\"Yes\", \"No\")","v":"No"},null,null,null,null,null,null,null,null,"sensorCommIotDigital"]
[290,320,null,"i",null,"e",null,"0-10V analog","sensorComm010V","boolean",null,null,null,null,false,{"$f":"IF(O320=TRUE,\"Yes\", \"No\")","v":"No"},{"$f":"IF(IF(ISNA(INDEX('Application V2'!A:M, MATCH(Application.!A320,'Application V2'!A:A,0),12)), \"\", INDEX('Application V2'!A:M, MATCH(Application.!A320,'Application V2'!A:A,0),12))=0, \"\", IF(ISNA(INDEX('Application V2'!A:M, MATCH(Application.!A320,'Application V2'!A:A,0),12)), \"\", INDEX('Application V2'!A:M, MATCH(Application.!A320,'Application V2'!A:A,0),12)))","v":""},null,null,null,null,null,null,null,"sensorComm010V"]
[291,321,null,"i",null,"e",null,"DALI2 SR Sensor Ready","sensorCommDaliSr","boolean",null,null,null,null,false,{"$f":"IF(O321=TRUE,\"Yes\", \"No\")","v":"No"},{"$f":"IF(IF(ISNA(INDEX('Application V2'!A:M, MATCH(Application.!A321,'Application V2'!A:A,0),12)), \"\", INDEX('Application V2'!A:M, MATCH(Application.!A321,'Application V2'!A:A,0),12))=0, \"\", IF(ISNA(INDEX('Application V2'!A:M, MATCH(Application.!A321,'Application V2'!A:A,0),12)), \"\", INDEX('Application V2'!A:M, MATCH(Application.!A321,'Application V2'!A:A,0),12)))","v":""},null,null,null,null,null,null,null,"sensorCommDaliSr"]
[291.10000000000002,322,null,"i",null,"e",null," D4i","sensorCommD4i","boolean",null,null,null,null,false,{"$f":"IF(O322=TRUE,\"Yes\", \"No\")","v":"No"}]
[291.2,323,null,"i",null,"e",null,"Zhaga Book 20","sensorCommZhaga20","boolean",null,null,null,null,false,"No"]
[292,324,null,"i",null,"e",null,"Other (explain)","sensorCommOther","text",null,null,null,null,null,{"$f":"IF(ISBLANK(M324),\"\",M324)","v":""},{"$f":"IF(IF(ISNA(INDEX('Application V2'!A:M, MATCH(Application.!A324,'Application V2'!A:A,0),12)), \"\", INDEX('Application V2'!A:M, MATCH(Application.!A324,'Application V2'!A:A,0),12))=0, \"\", IF(ISNA(INDEX('Application V2'!A:M, MATCH(Application.!A324,'Application V2'!A:A,0),12)), \"\", INDEX('Application V2'!A:M, MATCH(Application.!A324,'Application V2'!A:A,0),12)))","v":""},null,null,null,null,null,null,null,"sensorCommOther"]
[293,325,"  ","i ","   "," e","14)","Luminaire Level Lighting Control, Integrated","blank",null,null,null,null,null,null,null,{"$f":"IF(IF(ISNA(INDEX('Application V2'!A:M, MATCH(Application.!A325,'Application V2'!A:A,0),12)), \"\", INDEX('Application V2'!A:M, MATCH(Application.!A325,'Application V2'!A:A,0),12))=0, \"\", IF(ISNA(INDEX('Application V2'!A:M, MATCH(Application.!A325,'Application V2'!A:A,0),12)), \"\", INDEX('Application V2'!A:M, MATCH(Application.!A325,'Application V2'!A:A,0),12)))","v":""},null,null,null,null,null,null,null,"blank"]
[294,326,"  ","i ","   ",null,"15)","Personal Control","blank",null,null,null,null,null,null,null,{"$f":"IF(IF(ISNA(INDEX('Application V2'!A:M, MATCH(Application.!A326,'Application V2'!A:A,0),12)), \"\", INDEX('Application V2'!A:M, MATCH(Application.!A326,'Application V2'!A:A,0),12))=0, \"\", IF(ISNA(INDEX('Application V2'!A:M, MATCH(Application.!A326,'Application V2'!A:A,0),12)), \"\", INDEX('Application V2'!A:M, MATCH(Application.!A326,'Application V2'!A:A,0),12)))","v":""},null,null,null,null,null,null,null,"blank"]
[295,327,null,"i \n \n\n \n \n\n \n \n\n \n \n \n\n \n \n \n \n",null,null,"Definition:  The capability for individual users to adjust to their personal preferences, via networked means, the illuminated environment of a light fixture or group on of light fixtures in a specific task area.  The publicly available information must clearly describe a control interface for use by a single individual who does not have access to system-wide settings. \n\nA wireless dimmer switch may only be considered a personal control interface if product documentation: \n   (a) shows that the physical configuration is suitable for workstation use (i.e. a small, self-contained unit without any external wiring, suitable for use as a handheld remote control), and \n   (b) describes configuration for personal control within a larger area. \n\nA software-based interface may only be considered personal control if product documentation \n   (a) shows it provides a specific interface intended for personal control by an individual user within a subsection of a larger space and that \n   b) the interface only allows access to personal control functions for the light fixtures in the specific areas being controlled (i.e. each occupant can control their own area, but not their neighbors' areas).    ",null,"blank",null,null,null,null,null,null,null,{"$f":"IF(IF(ISNA(INDEX('Application V2'!A:M, MATCH(Application.!A327,'Application V2'!A:A,0),12)), \"\", INDEX('Application V2'!A:M, MATCH(Application.!A327,'Application V2'!A:A,0),12))=0, \"\", IF(ISNA(INDEX('Application V2'!A:M, MATCH(Application.!A327,'Application V2'!A:A,0),12)), \"\", INDEX('Application V2'!A:M, MATCH(Application.!A327,'Application V2'!A:A,0),12)))","v":""},null,null,null,null,null,null,null,"blank"]
[296,328,"   \n ","i  \n ","    \n "," \n ","Does the system have personal control capability, with instructions for how to configure and/or use this feature?",null,"hasPersonal","boolean",null,null,null,null,false,{"$f":"IF(O328=TRUE,\"Yes\", \"No\")","v":"No"},{"$f":"IF(IF(ISNA(INDEX('Application V2'!A:M, MATCH(Application.!A328,'Application V2'!A:A,0),12)), \"\", INDEX('Application V2'!A:M, MATCH(Application.!A328,'Application V2'!A:A,0),12))=0, \"\", IF(ISNA(INDEX('Application V2'!A:M, MATCH(Application.!A328,'Application V2'!A:A,0),12)), \"\", INDEX('Application V2'!A:M, MATCH(Application.!A328,'Application V2'!A:A,0),12)))","v":""},null,null,null,null,null,null,null,"hasPersonal"]
[297,329,"  ","i ","   ",null,"What interface does the personal control use? ",null,"personalPlatformConcat","concat 330:337",null,null,"Select all that apply",null,null,null,{"$f":"IF(IF(ISNA(INDEX('Application V2'!A:M, MATCH(Application.!A329,'Application V2'!A:A,0),12)), \"\", INDEX('Application V2'!A:M, MATCH(Application.!A329,'Application V2'!A:A,0),12))=0, \"\", IF(ISNA(INDEX('Application V2'!A:M, MATCH(Application.!A329,'Application V2'!A:A,0),12)), \"\", INDEX('Application V2'!A:M, MATCH(Application.!A329,'Application V2'!A:A,0),12)))","v":""},null,null,null,null,null,null,null,"personalPlatformConcat"]
[298,330,"  ","i ","   ",null,null,"App for Android","personalPlatformAppAndroid","boolean",null,null,null,null,false,{"$f":"IF(O330=TRUE,\"Yes\", \"No\")","v":"No"},{"$f":"IF(IF(ISNA(INDEX('Application V2'!A:M, MATCH(Application.!A330,'Application V2'!A:A,0),12)), \"\", INDEX('Application V2'!A:M, MATCH(Application.!A330,'Application V2'!A:A,0),12))=0, \"\", IF(ISNA(INDEX('Application V2'!A:M, MATCH(Application.!A330,'Application V2'!A:A,0),12)), \"\", INDEX('Application V2'!A:M, MATCH(Application.!A330,'Application V2'!A:A,0),12)))","v":""},null,null,null,null,null,null,null,"personalPlatformAppAndroid"]
[299,331,"  ","i ","   ",null,null,"App for IOS","personalPlatformAppIOS","boolean",null,null,null,null,false,"No",{"$f":"IF(IF(ISNA(INDEX('Application V2'!A:M, MATCH(Application.!A331,'Application V2'!A:A,0),12)), \"\", INDEX('Application V2'!A:M, MATCH(Application.!A331,'Application V2'!A:A,0),12))=0, \"\", IF(ISNA(INDEX('Application V2'!A:M, MATCH(Application.!A331,'Application V2'!A:A,0),12)), \"\", INDEX('Application V2'!A:M, MATCH(Application.!A331,'Application V2'!A:A,0),12)))","v":""},null,null,null,null,null,null,null,"personalPlatformAppIOS"]
[300,332,"  ","i ","   ",null,null,"Local wireless dimmer switch","personalPlatformSwitch","boolean",null,null,null,null,false,"No",{"$f":"IF(IF(ISNA(INDEX('Application V2'!A:M, MATCH(Application.!A332,'Application V2'!A:A,0),12)), \"\", INDEX('Application V2'!A:M, MATCH(Application.!A332,'Application V2'!A:A,0),12))=0, \"\", IF(ISNA(INDEX('Application V2'!A:M, MATCH(Application.!A332,'Application V2'!A:A,0),12)), \"\", INDEX('Application V2'!A:M, MATCH(Application.!A332,'Application V2'!A:A,0),12)))","v":""},null,null,null,null,null,null,null,"personalPlatformSwitch"]
[301,333,"  ","i ","   ",null,null,"Remote control w/o display","personalPlatformRemoteNoDisplay","boolean",null,null,null,null,false,"No",{"$f":"IF(IF(ISNA(INDEX('Application V2'!A:M, MATCH(Application.!A333,'Application V2'!A:A,0),12)), \"\", INDEX('Application V2'!A:M, MATCH(Application.!A333,'Application V2'!A:A,0),12))=0, \"\", IF(ISNA(INDEX('Application V2'!A:M, MATCH(Application.!A333,'Application V2'!A:A,0),12)), \"\", INDEX('Application V2'!A:M, MATCH(Application.!A333,'Application V2'!A:A,0),12)))","v":""},null,null,null,null,null,null,null,"personalPlatformRemoteNoDisplay"]
[302,334,"  ","i ","   ",null,null,"Remote control with display","personalPlatformRemoteDisplay","boolean",null,null,null,null,false,"No",{"$f":"IF(IF(ISNA(INDEX('Application V2'!A:M, MATCH(Application.!A334,'Application V2'!A:A,0),12)), \"\", INDEX('Application V2'!A:M, MATCH(Application.!A334,'Application V2'!A:A,0),12))=0, \"\", IF(ISNA(INDEX('Application V2'!A:M, MATCH(Application.!A334,'Application V2'!A:A,0),12)), \"\", INDEX('Application V2'!A:M, MATCH(Application.!A334,'Application V2'!A:A,0),12)))","v":""},null,null,null,null,null,null,null,"personalPlatformRemoteDisplay"]
[303,335,"  ","i ","   ",null,null,"Web browser (Windows & IOS)","personalPlatformWeb","boolean",null,null,null,null,false,"No",{"$f":"IF(IF(ISNA(INDEX('Application V2'!A:M, MATCH(Application.!A335,'Application V2'!A:A,0),12)), \"\", INDEX('Application V2'!A:M, MATCH(Application.!A335,'Application V2'!A:A,0),12))=0, \"\", IF(ISNA(INDEX('Application V2'!A:M, MATCH(Application.!A335,'Application V2'!A:A,0),12)), \"\", INDEX('Application V2'!A:M, MATCH(Application.!A335,'Application V2'!A:A,0),12)))","v":""},null,null,null,null,null,null,null,"personalPlatformWeb"]
[304,336,"  ","i ","   ",null,null,"Windows-based software program","personalPlatformWindows","boolean",null,null,null,null,false,"No",{"$f":"IF(IF(ISNA(INDEX('Application V2'!A:M, MATCH(Application.!A336,'Application V2'!A:A,0),12)), \"\", INDEX('Application V2'!A:M, MATCH(Application.!A336,'Application V2'!A:A,0),12))=0, \"\", IF(ISNA(INDEX('Application V2'!A:M, MATCH(Application.!A336,'Application V2'!A:A,0),12)), \"\", INDEX('Application V2'!A:M, MATCH(Application.!A336,'Application V2'!A:A,0),12)))","v":""},null,null,null,null,null,null,null,"personalPlatformWindows"]
[305,337,null,null,null,null,null,"Other (explain)","personalPlatformOther","text",null,null,null,null,null,{"$f":"IF(ISBLANK(M337),\"\",M337)","v":""},{"$f":"IF(IF(ISNA(INDEX('Application V2'!A:M, MATCH(Application.!A337,'Application V2'!A:A,0),12)), \"\", INDEX('Application V2'!A:M, MATCH(Application.!A337,'Application V2'!A:A,0),12))=0, \"\", IF(ISNA(INDEX('Application V2'!A:M, MATCH(Application.!A337,'Application V2'!A:A,0),12)), \"\", INDEX('Application V2'!A:M, MATCH(Application.!A337,'Application V2'!A:A,0),12)))","v":""},null,null,null,null,null,null,null,"personalPlatformOther"]
[306,338,"  ","i ","   ",null,"Can luminaires be zoned/grouped for personalPlatform control?",null,"personalZones","boolean",null,null,null,null,false,{"$f":"IF(O338=TRUE,\"Yes\", \"No\")","v":"No"},{"$f":"IF(IF(ISNA(INDEX('Application V2'!A:M, MATCH(Application.!A338,'Application V2'!A:A,0),12)), \"\", INDEX('Application V2'!A:M, MATCH(Application.!A338,'Application V2'!A:A,0),12))=0, \"\", IF(ISNA(INDEX('Application V2'!A:M, MATCH(Application.!A338,'Application V2'!A:A,0),12)), \"\", INDEX('Application V2'!A:M, MATCH(Application.!A338,'Application V2'!A:A,0),12)))","v":""},null,null,null,null,null,null,null,"personalZones"]
[307,339,"  ","i ","   ",null,"15)","Personal Control","blank",null,null,null,null,null,null,null,{"$f":"IF(IF(ISNA(INDEX('Application V2'!A:M, MATCH(Application.!A339,'Application V2'!A:A,0),12)), \"\", INDEX('Application V2'!A:M, MATCH(Application.!A339,'Application V2'!A:A,0),12))=0, \"\", IF(ISNA(INDEX('Application V2'!A:M, MATCH(Application.!A339,'Application V2'!A:A,0),12)), \"\", INDEX('Application V2'!A:M, MATCH(Application.!A339,'Application V2'!A:A,0),12)))","v":""},null,null,null,null,null,null,null,"blank"]
[308,340,"  ","i ","   "," e","16)","Load Shedding (Demand Response)","blank",null,null,null,null,null,null,null,{"$f":"IF(IF(ISNA(INDEX('Application V2'!A:M, MATCH(Application.!A340,'Application V2'!A:A,0),12)), \"\", INDEX('Application V2'!A:M, MATCH(Application.!A340,'Application V2'!A:A,0),12))=0, \"\", IF(ISNA(INDEX('Application V2'!A:M, MATCH(Application.!A340,'Application V2'!A:A,0),12)), \"\", INDEX('Application V2'!A:M, MATCH(Application.!A340,'Application V2'!A:A,0),12)))","v":""},null,null,null,null,null,null,null,"blank"]
[309,341,"\n \n \n \n \n","\n \n \n \n \n\n\n\n\n\n","\n \n \n \n \n","\n \n \n \n \n","Definition:  The capability to reduce the energy consumption of a lighting system, in a pre-defined way, on a temporary basis, in response to a demand response signal without manual intervention. The method by which the system implements this capability (managed by NLC and/or BMS) must be clearly described in the publicly available reference(s). The method for pre-defining the system behavior for temporary load reduction must be accessible through a user interface. The data the NLC can receive and interpret from other networked systems must include at least a signal that can be used for purposes such as LS/DR.",null,"blank",null,null,null,null,null,null,null,{"$f":"IF(IF(ISNA(INDEX('Application V2'!A:M, MATCH(Application.!A341,'Application V2'!A:A,0),12)), \"\", INDEX('Application V2'!A:M, MATCH(Application.!A341,'Application V2'!A:A,0),12))=0, \"\", IF(ISNA(INDEX('Application V2'!A:M, MATCH(Application.!A341,'Application V2'!A:A,0),12)), \"\", INDEX('Application V2'!A:M, MATCH(Application.!A341,'Application V2'!A:A,0),12)))","v":""},null,null,null,null,null,null,null,"blank"]
[310,342,"  ","i "," "," e","Does the system have load-shedding/demand response capability, with instructions for how to configure and/or use this feature?",null,"hasDR","boolean",null,null,null,null,false,{"$f":"IF(O342=TRUE,\"Yes\", \"No\")","v":"No"},{"$f":"IF(IF(ISNA(INDEX('Application V2'!A:M, MATCH(Application.!A342,'Application V2'!A:A,0),12)), \"\", INDEX('Application V2'!A:M, MATCH(Application.!A342,'Application V2'!A:A,0),12))=0, \"\", IF(ISNA(INDEX('Application V2'!A:M, MATCH(Application.!A342,'Application V2'!A:A,0),12)), \"\", INDEX('Application V2'!A:M, MATCH(Application.!A342,'Application V2'!A:A,0),12)))","v":""},null,null,null,null,null,null,null,"hasDR"]
[311,343,"  \n ","i \n ","   \n "," e\n ","Does the system have the ability to implement demand response via an external signal? ",null,"drSignal","boolean",null,null,null,null,false,{"$f":"IF(O343=TRUE,\"Yes\", \"No\")","v":"No"},{"$f":"IF(IF(ISNA(INDEX('Application V2'!A:M, MATCH(Application.!A343,'Application V2'!A:A,0),12)), \"\", INDEX('Application V2'!A:M, MATCH(Application.!A343,'Application V2'!A:A,0),12))=0, \"\", IF(ISNA(INDEX('Application V2'!A:M, MATCH(Application.!A343,'Application V2'!A:A,0),12)), \"\", INDEX('Application V2'!A:M, MATCH(Application.!A343,'Application V2'!A:A,0),12)))","v":""},null,null,null,null,null,null,null,"drSignal"]
[312,344,"  ","i ","   "," e","If yes, how?",null,"drSignalConcat","concat 345:350",null,null,"Select all that apply",null,null,null,{"$f":"IF(IF(ISNA(INDEX('Application V2'!A:M, MATCH(Application.!A344,'Application V2'!A:A,0),12)), \"\", INDEX('Application V2'!A:M, MATCH(Application.!A344,'Application V2'!A:A,0),12))=0, \"\", IF(ISNA(INDEX('Application V2'!A:M, MATCH(Application.!A344,'Application V2'!A:A,0),12)), \"\", INDEX('Application V2'!A:M, MATCH(Application.!A344,'Application V2'!A:A,0),12)))","v":""},null,null,null,null,null,null,null,"drSignalConcat"]
[313,345,"  ","i ","   "," e",null,"BACnet","drSignalBacnet","boolean",null,null,null,null,false,{"$f":"IF(O345=TRUE,\"Yes\", \"No\")","v":"No"},{"$f":"IF(IF(ISNA(INDEX('Application V2'!A:M, MATCH(Application.!A345,'Application V2'!A:A,0),12)), \"\", INDEX('Application V2'!A:M, MATCH(Application.!A345,'Application V2'!A:A,0),12))=0, \"\", IF(ISNA(INDEX('Application V2'!A:M, MATCH(Application.!A345,'Application V2'!A:A,0),12)), \"\", INDEX('Application V2'!A:M, MATCH(Application.!A345,'Application V2'!A:A,0),12)))","v":""},null,null,null,null,null,null,null,"drSignalBacnet"]
[314,346,"  ","i ","   "," e",null,"Dry contact","drSignalDryContact","boolean",null,null,null,null,false,{"$f":"IF(O346=TRUE,\"Yes\", \"No\")","v":"No"},{"$f":"IF(IF(ISNA(INDEX('Application V2'!A:M, MATCH(Application.!A346,'Application V2'!A:A,0),12)), \"\", INDEX('Application V2'!A:M, MATCH(Application.!A346,'Application V2'!A:A,0),12))=0, \"\", IF(ISNA(INDEX('Application V2'!A:M, MATCH(Application.!A346,'Application V2'!A:A,0),12)), \"\", INDEX('Application V2'!A:M, MATCH(Application.!A346,'Application V2'!A:A,0),12)))","v":""},null,null,null,null,null,null,null,"drSignalDryContact"]
[315,347,"  ","i ","   "," e",null,"OpenADR via internet","drSignalOpenAdrWeb","boolean",null,null,null,null,false,{"$f":"IF(O347=TRUE,\"Yes\", \"No\")","v":"No"},{"$f":"IF(IF(ISNA(INDEX('Application V2'!A:M, MATCH(Application.!A347,'Application V2'!A:A,0),12)), \"\", INDEX('Application V2'!A:M, MATCH(Application.!A347,'Application V2'!A:A,0),12))=0, \"\", IF(ISNA(INDEX('Application V2'!A:M, MATCH(Application.!A347,'Application V2'!A:A,0),12)), \"\", INDEX('Application V2'!A:M, MATCH(Application.!A347,'Application V2'!A:A,0),12)))","v":""},null,null,null,null,null,null,null,"drSignalOpenAdrWeb"]
[316,348,"  ","i ","   "," e",null,"Programmed digital switch","drSignalSwitch","boolean",null,null,null,null,false,{"$f":"IF(O348=TRUE,\"Yes\", \"No\")","v":"No"},{"$f":"IF(IF(ISNA(INDEX('Application V2'!A:M, MATCH(Application.!A348,'Application V2'!A:A,0),12)), \"\", INDEX('Application V2'!A:M, MATCH(Application.!A348,'Application V2'!A:A,0),12))=0, \"\", IF(ISNA(INDEX('Application V2'!A:M, MATCH(Application.!A348,'Application V2'!A:A,0),12)), \"\", INDEX('Application V2'!A:M, MATCH(Application.!A348,'Application V2'!A:A,0),12)))","v":""},null,null,null,null,null,null,null,"drSignalSwitch"]
[317,349,"  ","i ","   "," e",null,"Third Party hardware and software","drSignalThirdParty","boolean",null,null,null,null,false,{"$f":"IF(O349=TRUE,\"Yes\", \"No\")","v":"No"},{"$f":"IF(IF(ISNA(INDEX('Application V2'!A:M, MATCH(Application.!A349,'Application V2'!A:A,0),12)), \"\", INDEX('Application V2'!A:M, MATCH(Application.!A349,'Application V2'!A:A,0),12))=0, \"\", IF(ISNA(INDEX('Application V2'!A:M, MATCH(Application.!A349,'Application V2'!A:A,0),12)), \"\", INDEX('Application V2'!A:M, MATCH(Application.!A349,'Application V2'!A:A,0),12)))","v":""},null,null,null,null,null,null,null,"drSignalThirdParty"]
[318,350,"  ","i ","   "," e",null,"Other","drSignalOther","text",null,null,null,null,null,{"$f":"IF(ISBLANK(M350),\"\",M350)","v":""},{"$f":"IF(IF(ISNA(INDEX('Application V2'!A:M, MATCH(Application.!A350,'Application V2'!A:A,0),12)), \"\", INDEX('Application V2'!A:M, MATCH(Application.!A350,'Application V2'!A:A,0),12))=0, \"\", IF(ISNA(INDEX('Application V2'!A:M, MATCH(Application.!A350,'Application V2'!A:A,0),12)), \"\", INDEX('Application V2'!A:M, MATCH(Application.!A350,'Application V2'!A:A,0),12)))","v":""},null,null,null,null,null,null,null,"drSignalOther"]
[319,351,null,"i ",null," e","Does the system have the ability to report real-time power usage? ",null,"drReportPowerUsage","boolean",null,null,null,null,false,{"$f":"IF(O351=TRUE,\"Yes\", \"No\")","v":"No"},{"$f":"IF(IF(ISNA(INDEX('Application V2'!A:M, MATCH(Application.!A351,'Application V2'!A:A,0),12)), \"\", INDEX('Application V2'!A:M, MATCH(Application.!A351,'Application V2'!A:A,0),12))=0, \"\", IF(ISNA(INDEX('Application V2'!A:M, MATCH(Application.!A351,'Application V2'!A:A,0),12)), \"\", INDEX('Application V2'!A:M, MATCH(Application.!A351,'Application V2'!A:A,0),12)))","v":""},null,null,null,null,null,null,null,"drReport"]
[319.10000000000002,352,null,"i",null,"e",null,"If yes, can it be reported to a non-OpenADR third party API?","drReportApi","boolean",null,null,null,null,false,{"$f":"IF(O352=TRUE,\"Yes\", \"No\")","v":"No"}]
[319.2,353,null,"i",null,"e",null,"                                             Describe the mechanism of reporting","drReportMechanism","text",null,null,null,null,null,{"$f":"IF(ISBLANK(M353),\"\",M353)","v":""}]
[319.3,354,null,"i",null,"e","Does the system have the ability to report real-time energy usage? ",null,"drReportEnergyUsage","boolean",null,null,null,null,false,{"$f":"IF(O354=TRUE,\"Yes\", \"No\")","v":"No"}]
[320,355,"\n","i  \n","\n"," e\n","Is the OpenADR component listed in the OpenADR certified products database at https://products.openadr.org/ ?",null,"drOpenADRcertified","boolean",null,null,null,null,false,{"$f":"IF(O355=TRUE,\"Yes\", \"No\")","v":"No"},{"$f":"IF(IF(ISNA(INDEX('Application V2'!A:M, MATCH(Application.!A355,'Application V2'!A:A,0),12)), \"\", INDEX('Application V2'!A:M, MATCH(Application.!A355,'Application V2'!A:A,0),12))=0, \"\", IF(ISNA(INDEX('Application V2'!A:M, MATCH(Application.!A355,'Application V2'!A:A,0),12)), \"\", INDEX('Application V2'!A:M, MATCH(Application.!A355,'Application V2'!A:A,0),12)))","v":""},null,null,null,null,null,null,null,"drOpenADRcertified"]
[321,356,"  ","i ","   "," e",null,"If yes, what version of OpenADR?","drOpenADRvConcat","concat 357:359",null,null,"Select all that apply",null,null,null,{"$f":"IF(IF(ISNA(INDEX('Application V2'!A:M, MATCH(Application.!A356,'Application V2'!A:A,0),12)), \"\", INDEX('Application V2'!A:M, MATCH(Application.!A356,'Application V2'!A:A,0),12))=0, \"\", IF(ISNA(INDEX('Application V2'!A:M, MATCH(Application.!A356,'Application V2'!A:A,0),12)), \"\", INDEX('Application V2'!A:M, MATCH(Application.!A356,'Application V2'!A:A,0),12)))","v":""},null,null,null,null,null,null,null,"drOpenADRvConcat"]
[322,357,"  ","i ","   "," e",null,"1.0","drOpenADRv1","boolean",null,null,null,null,false,{"$f":"IF(O357=TRUE,\"Yes\", \"No\")","v":"No"},{"$f":"IF(IF(ISNA(INDEX('Application V2'!A:M, MATCH(Application.!A357,'Application V2'!A:A,0),12)), \"\", INDEX('Application V2'!A:M, MATCH(Application.!A357,'Application V2'!A:A,0),12))=0, \"\", IF(ISNA(INDEX('Application V2'!A:M, MATCH(Application.!A357,'Application V2'!A:A,0),12)), \"\", INDEX('Application V2'!A:M, MATCH(Application.!A357,'Application V2'!A:A,0),12)))","v":""},null,null,null,null,null,null,null,"drOpenADRv1"]
[323,358,"  ","i ","   "," e",null,"2.0a","drOpenADRv2a","boolean",null,null,null,null,false,{"$f":"IF(O358=TRUE,\"Yes\", \"No\")","v":"No"},{"$f":"IF(IF(ISNA(INDEX('Application V2'!A:M, MATCH(Application.!A358,'Application V2'!A:A,0),12)), \"\", INDEX('Application V2'!A:M, MATCH(Application.!A358,'Application V2'!A:A,0),12))=0, \"\", IF(ISNA(INDEX('Application V2'!A:M, MATCH(Application.!A358,'Application V2'!A:A,0),12)), \"\", INDEX('Application V2'!A:M, MATCH(Application.!A358,'Application V2'!A:A,0),12)))","v":""},null,null,null,null,null,null,null,"drOpenADRv2a"]
[324,359,"  ","i ","   "," e",null,"2.0b","drOpenADRv2b","boolean",null,null,null,null,false,{"$f":"IF(O359=TRUE,\"Yes\", \"No\")","v":"No"},{"$f":"IF(IF(ISNA(INDEX('Application V2'!A:M, MATCH(Application.!A359,'Application V2'!A:A,0),12)), \"\", INDEX('Application V2'!A:M, MATCH(Application.!A359,'Application V2'!A:A,0),12))=0, \"\", IF(ISNA(INDEX('Application V2'!A:M, MATCH(Application.!A359,'Application V2'!A:A,0),12)), \"\", INDEX('Application V2'!A:M, MATCH(Application.!A359,'Application V2'!A:A,0),12)))","v":""},null,null,null,null,null,null,null,"drOpenADRv2b"]
[325,360,null,"i ","   "," e","How is load shedding implemented in the system?",null,"drHowConcat","concat 361:363",null,null,null,null,null,null,{"$f":"IF(IF(ISNA(INDEX('Application V2'!A:M, MATCH(Application.!A360,'Application V2'!A:A,0),12)), \"\", INDEX('Application V2'!A:M, MATCH(Application.!A360,'Application V2'!A:A,0),12))=0, \"\", IF(ISNA(INDEX('Application V2'!A:M, MATCH(Application.!A360,'Application V2'!A:A,0),12)), \"\", INDEX('Application V2'!A:M, MATCH(Application.!A360,'Application V2'!A:A,0),12)))","v":""},null,null,null,null,null,null,null,"drHowConcat"]
[326,361,null,"i ","   "," e",null,"A dedicated (configurable) scene","drHowScene","boolean",null,null,null,null,false,{"$f":"IF(O361=TRUE,\"Yes\", \"No\")","v":"No"},{"$f":"IF(IF(ISNA(INDEX('Application V2'!A:M, MATCH(Application.!A361,'Application V2'!A:A,0),12)), \"\", INDEX('Application V2'!A:M, MATCH(Application.!A361,'Application V2'!A:A,0),12))=0, \"\", IF(ISNA(INDEX('Application V2'!A:M, MATCH(Application.!A361,'Application V2'!A:A,0),12)), \"\", INDEX('Application V2'!A:M, MATCH(Application.!A361,'Application V2'!A:A,0),12)))","v":""},null,null,null,null,null,null,null,"drHowScene"]
[327,362,null,"i ","   "," e",null,"A native/built-in light level scale-back","drHowLevel","boolean",null,null,null,null,false,{"$f":"IF(O362=TRUE,\"Yes\", \"No\")","v":"No"},{"$f":"IF(IF(ISNA(INDEX('Application V2'!A:M, MATCH(Application.!A362,'Application V2'!A:A,0),12)), \"\", INDEX('Application V2'!A:M, MATCH(Application.!A362,'Application V2'!A:A,0),12))=0, \"\", IF(ISNA(INDEX('Application V2'!A:M, MATCH(Application.!A362,'Application V2'!A:A,0),12)), \"\", INDEX('Application V2'!A:M, MATCH(Application.!A362,'Application V2'!A:A,0),12)))","v":""},null,null,null,null,null,null,null,"drHowLevel"]
[328,363,null,"i ","   "," e",null,"Other (describe)","drHowOther","text",null,null,null,null,null,{"$f":"IF(ISBLANK(M363),\"\",M363)","v":""},{"$f":"IF(IF(ISNA(INDEX('Application V2'!A:M, MATCH(Application.!A363,'Application V2'!A:A,0),12)), \"\", INDEX('Application V2'!A:M, MATCH(Application.!A363,'Application V2'!A:A,0),12))=0, \"\", IF(ISNA(INDEX('Application V2'!A:M, MATCH(Application.!A363,'Application V2'!A:A,0),12)), \"\", INDEX('Application V2'!A:M, MATCH(Application.!A363,'Application V2'!A:A,0),12)))","v":""},null,null,null,null,null,null,null,"drHowOther"]
[329,364,"  ","i ","   "," e","16)","Load Shedding/ Demand Response","blank",null,null,null,null,null,null,null,{"$f":"IF(IF(ISNA(INDEX('Application V2'!A:M, MATCH(Application.!A364,'Application V2'!A:A,0),12)), \"\", INDEX('Application V2'!A:M, MATCH(Application.!A364,'Application V2'!A:A,0),12))=0, \"\", IF(ISNA(INDEX('Application V2'!A:M, MATCH(Application.!A364,'Application V2'!A:A,0),12)), \"\", INDEX('Application V2'!A:M, MATCH(Application.!A364,'Application V2'!A:A,0),12)))","v":""},null,null,null,null,null,null,null,"blank"]
[330,365,"  ","i ","   "," e","17)","Plug Load Control","blank",null,null,null,null,null,null,null,{"$f":"IF(IF(ISNA(INDEX('Application V2'!A:M, MATCH(Application.!A365,'Application V2'!A:A,0),12)), \"\", INDEX('Application V2'!A:M, MATCH(Application.!A365,'Application V2'!A:A,0),12))=0, \"\", IF(ISNA(INDEX('Application V2'!A:M, MATCH(Application.!A365,'Application V2'!A:A,0),12)), \"\", INDEX('Application V2'!A:M, MATCH(Application.!A365,'Application V2'!A:A,0),12)))","v":""},null,null,null,null,null,null,null,"blank"]
[331,366," \n \n \n \n"," \n \n \n \n"," \n \n \n \n"," \n \n \n \n","Definition:  The capability to control the power delivered to receptacles through scheduling or occupancy sensing. The method by which the system implements this capability must be clearly described in the publicly available reference(s).",null,"blank",null,null,null,null,null,null,null,{"$f":"IF(IF(ISNA(INDEX('Application V2'!A:M, MATCH(Application.!A366,'Application V2'!A:A,0),12)), \"\", INDEX('Application V2'!A:M, MATCH(Application.!A366,'Application V2'!A:A,0),12))=0, \"\", IF(ISNA(INDEX('Application V2'!A:M, MATCH(Application.!A366,'Application V2'!A:A,0),12)), \"\", INDEX('Application V2'!A:M, MATCH(Application.!A366,'Application V2'!A:A,0),12)))","v":""},null,null,null,null,null,null,null,"blank"]
[332,367,"  ","i ","   "," e","Is plug load control available, with instructions for how to configure and/or use this feature?",null,"hasPlug","boolean",null,null,null,null,false,{"$f":"IF(O367=TRUE,\"Yes\", \"No\")","v":"No"},{"$f":"IF(IF(ISNA(INDEX('Application V2'!A:M, MATCH(Application.!A367,'Application V2'!A:A,0),12)), \"\", INDEX('Application V2'!A:M, MATCH(Application.!A367,'Application V2'!A:A,0),12))=0, \"\", IF(ISNA(INDEX('Application V2'!A:M, MATCH(Application.!A367,'Application V2'!A:A,0),12)), \"\", INDEX('Application V2'!A:M, MATCH(Application.!A367,'Application V2'!A:A,0),12)))","v":""},null,null,null,null,null,null,null,"hasPlug"]
[333,368,null,"i ","   "," e","What method is used?",null,"plugHardwareConcat","concat 369:371",null,null,"Select all that apply",null,null,null,{"$f":"IF(IF(ISNA(INDEX('Application V2'!A:M, MATCH(Application.!A368,'Application V2'!A:A,0),12)), \"\", INDEX('Application V2'!A:M, MATCH(Application.!A368,'Application V2'!A:A,0),12))=0, \"\", IF(ISNA(INDEX('Application V2'!A:M, MATCH(Application.!A368,'Application V2'!A:A,0),12)), \"\", INDEX('Application V2'!A:M, MATCH(Application.!A368,'Application V2'!A:A,0),12)))","v":""},null,null,null,null,null,null,null,"plugHardwareConcat"]
[334,369,null,"i ","   "," e",null,"Smart outlet with integrated control","plugHardwareSmartOutlet","boolean",null,null,null,null,false,{"$f":"IF(O369=TRUE,\"Yes\", \"No\")","v":"No"},{"$f":"IF(IF(ISNA(INDEX('Application V2'!A:M, MATCH(Application.!A369,'Application V2'!A:A,0),12)), \"\", INDEX('Application V2'!A:M, MATCH(Application.!A369,'Application V2'!A:A,0),12))=0, \"\", IF(ISNA(INDEX('Application V2'!A:M, MATCH(Application.!A369,'Application V2'!A:A,0),12)), \"\", INDEX('Application V2'!A:M, MATCH(Application.!A369,'Application V2'!A:A,0),12)))","v":""},null,null,null,null,null,null,null,"plugHardwareSmartOutlet"]
[335,370,null,"i ","   "," e",null,"Circuit level relay switch","plugHardwareCircuitRelay","boolean",null,null,null,null,false,{"$f":"IF(O370=TRUE,\"Yes\", \"No\")","v":"No"},{"$f":"IF(IF(ISNA(INDEX('Application V2'!A:M, MATCH(Application.!A370,'Application V2'!A:A,0),12)), \"\", INDEX('Application V2'!A:M, MATCH(Application.!A370,'Application V2'!A:A,0),12))=0, \"\", IF(ISNA(INDEX('Application V2'!A:M, MATCH(Application.!A370,'Application V2'!A:A,0),12)), \"\", INDEX('Application V2'!A:M, MATCH(Application.!A370,'Application V2'!A:A,0),12)))","v":""},null,null,null,null,null,null,null,"plugHardwareCircuitRelay"]
[336,371,null,"i ","   "," e",null,"Other (explain)","plugHardwareOther","text",null,null,null,null,{"$f":"M371","v":0},null,{"$f":"IF(IF(ISNA(INDEX('Application V2'!A:M, MATCH(Application.!A371,'Application V2'!A:A,0),12)), \"\", INDEX('Application V2'!A:M, MATCH(Application.!A371,'Application V2'!A:A,0),12))=0, \"\", IF(ISNA(INDEX('Application V2'!A:M, MATCH(Application.!A371,'Application V2'!A:A,0),12)), \"\", INDEX('Application V2'!A:M, MATCH(Application.!A371,'Application V2'!A:A,0),12)))","v":""},null,null,null,null,null,null,null,"plugHardwareOther"]
[337,372,"  ","i ","   "," e","What are the available control strategies? ",null,"plugModeConcat","concat 373:380",null,null,"Select all that apply",null,null,null,{"$f":"IF(IF(ISNA(INDEX('Application V2'!A:M, MATCH(Application.!A372,'Application V2'!A:A,0),12)), \"\", INDEX('Application V2'!A:M, MATCH(Application.!A372,'Application V2'!A:A,0),12))=0, \"\", IF(ISNA(INDEX('Application V2'!A:M, MATCH(Application.!A372,'Application V2'!A:A,0),12)), \"\", INDEX('Application V2'!A:M, MATCH(Application.!A372,'Application V2'!A:A,0),12)))","v":""},null,null,null,null,null,null,null,"plugModeConcat"]
[338,373,"  ","i ","   "," e",null,"BACnet signal","plugModeBACnet","boolean",null,null,null,null,false,{"$f":"IF(O373=TRUE,\"Yes\", \"No\")","v":"No"},{"$f":"IF(IF(ISNA(INDEX('Application V2'!A:M, MATCH(Application.!A373,'Application V2'!A:A,0),12)), \"\", INDEX('Application V2'!A:M, MATCH(Application.!A373,'Application V2'!A:A,0),12))=0, \"\", IF(ISNA(INDEX('Application V2'!A:M, MATCH(Application.!A373,'Application V2'!A:A,0),12)), \"\", INDEX('Application V2'!A:M, MATCH(Application.!A373,'Application V2'!A:A,0),12)))","v":""},null,null,null,null,null,null,null,"plugModeBACnet"]
[339,374,"  ","i ","   "," e",null,"Demand response","plugModeDr","boolean",null,null,null,null,false,"No",{"$f":"IF(IF(ISNA(INDEX('Application V2'!A:M, MATCH(Application.!A374,'Application V2'!A:A,0),12)), \"\", INDEX('Application V2'!A:M, MATCH(Application.!A374,'Application V2'!A:A,0),12))=0, \"\", IF(ISNA(INDEX('Application V2'!A:M, MATCH(Application.!A374,'Application V2'!A:A,0),12)), \"\", INDEX('Application V2'!A:M, MATCH(Application.!A374,'Application V2'!A:A,0),12)))","v":""},null,null,null,null,null,null,null,"plugModeDr"]
[340,375,"  ","i ","   "," e",null,"Manual control","plugModeManual","boolean",null,null,null,null,false,"No",{"$f":"IF(IF(ISNA(INDEX('Application V2'!A:M, MATCH(Application.!A375,'Application V2'!A:A,0),12)), \"\", INDEX('Application V2'!A:M, MATCH(Application.!A375,'Application V2'!A:A,0),12))=0, \"\", IF(ISNA(INDEX('Application V2'!A:M, MATCH(Application.!A375,'Application V2'!A:A,0),12)), \"\", INDEX('Application V2'!A:M, MATCH(Application.!A375,'Application V2'!A:A,0),12)))","v":""},null,null,null,null,null,null,null,"plugModeManual"]
[341,376,"  ","i ","   "," e",null,"Occupancy","plugModeOccupancy","boolean",null,null,null,null,false,"No",{"$f":"IF(IF(ISNA(INDEX('Application V2'!A:M, MATCH(Application.!A376,'Application V2'!A:A,0),12)), \"\", INDEX('Application V2'!A:M, MATCH(Application.!A376,'Application V2'!A:A,0),12))=0, \"\", IF(ISNA(INDEX('Application V2'!A:M, MATCH(Application.!A376,'Application V2'!A:A,0),12)), \"\", INDEX('Application V2'!A:M, MATCH(Application.!A376,'Application V2'!A:A,0),12)))","v":""},null,null,null,null,null,null,null,"plugModeOccupancy"]
[342,377,"  ","i ","   "," e",null,"Personal control","plugModePersonal","boolean",null,null,null,null,false,"No",{"$f":"IF(IF(ISNA(INDEX('Application V2'!A:M, MATCH(Application.!A377,'Application V2'!A:A,0),12)), \"\", INDEX('Application V2'!A:M, MATCH(Application.!A377,'Application V2'!A:A,0),12))=0, \"\", IF(ISNA(INDEX('Application V2'!A:M, MATCH(Application.!A377,'Application V2'!A:A,0),12)), \"\", INDEX('Application V2'!A:M, MATCH(Application.!A377,'Application V2'!A:A,0),12)))","v":""},null,null,null,null,null,null,null,"plugModePersonal"]
[343,378,"  ","i ","   "," e",null,"Scheduling","plugModeScheduling","boolean",null,null,null,null,false,"No",{"$f":"IF(IF(ISNA(INDEX('Application V2'!A:M, MATCH(Application.!A378,'Application V2'!A:A,0),12)), \"\", INDEX('Application V2'!A:M, MATCH(Application.!A378,'Application V2'!A:A,0),12))=0, \"\", IF(ISNA(INDEX('Application V2'!A:M, MATCH(Application.!A378,'Application V2'!A:A,0),12)), \"\", INDEX('Application V2'!A:M, MATCH(Application.!A378,'Application V2'!A:A,0),12)))","v":""},null,null,null,null,null,null,null,"plugModeScheduling"]
[344,379,"  ","i ","   "," e",null,"Web/mobile interface","plugModeUi","boolean",null,null,null,null,false,"No",{"$f":"IF(IF(ISNA(INDEX('Application V2'!A:M, MATCH(Application.!A379,'Application V2'!A:A,0),12)), \"\", INDEX('Application V2'!A:M, MATCH(Application.!A379,'Application V2'!A:A,0),12))=0, \"\", IF(ISNA(INDEX('Application V2'!A:M, MATCH(Application.!A379,'Application V2'!A:A,0),12)), \"\", INDEX('Application V2'!A:M, MATCH(Application.!A379,'Application V2'!A:A,0),12)))","v":""},null,null,null,null,null,null,null,"plugModeUi"]
[345,380,"  ","i ","   "," e",null,"Other (explain)","plugModeOther","text",null,null,null,null,null,{"$f":"IF(ISBLANK(M380),\"\",M380)","v":""},{"$f":"IF(IF(ISNA(INDEX('Application V2'!A:M, MATCH(Application.!A380,'Application V2'!A:A,0),12)), \"\", INDEX('Application V2'!A:M, MATCH(Application.!A380,'Application V2'!A:A,0),12))=0, \"\", IF(ISNA(INDEX('Application V2'!A:M, MATCH(Application.!A380,'Application V2'!A:A,0),12)), \"\", INDEX('Application V2'!A:M, MATCH(Application.!A380,'Application V2'!A:A,0),12)))","v":""},null,null,null,null,null,null,null,"plugModeOther"]
[346,381,"   \n ","i  \n ","    \n "," e \n ","Does the system have the ability to monitor and report energy use of plug loads? ",null,"plugData","boolean",null,null,null,null,false,{"$f":"IF(O381=TRUE,\"Yes\", \"No\")","v":"No"},{"$f":"IF(IF(ISNA(INDEX('Application V2'!A:M, MATCH(Application.!A381,'Application V2'!A:A,0),12)), \"\", INDEX('Application V2'!A:M, MATCH(Application.!A381,'Application V2'!A:A,0),12))=0, \"\", IF(ISNA(INDEX('Application V2'!A:M, MATCH(Application.!A381,'Application V2'!A:A,0),12)), \"\", INDEX('Application V2'!A:M, MATCH(Application.!A381,'Application V2'!A:A,0),12)))","v":""},null,null,null,null,null,null,null,"plugData"]
[346.1,382,null,"i",null,"e","Does the system support third party APIs for plug load energy data? ",null,"plugThirdPartyApi","boolean",null,null,null,null,false,{"$f":"IF(O382=TRUE,\"Yes\", \"No\")","v":"No"}]
[347,383,"  ","i ","   "," e","17)","Plug Load Control","blank",null,null,null,null,null,null,null,{"$f":"IF(IF(ISNA(INDEX('Application V2'!A:M, MATCH(Application.!A383,'Application V2'!A:A,0),12)), \"\", INDEX('Application V2'!A:M, MATCH(Application.!A383,'Application V2'!A:A,0),12))=0, \"\", IF(ISNA(INDEX('Application V2'!A:M, MATCH(Application.!A383,'Application V2'!A:A,0),12)), \"\", INDEX('Application V2'!A:M, MATCH(Application.!A383,'Application V2'!A:A,0),12)))","v":""},null,null,null,null,null,null,null,"blank"]
[348,384,"  ","i ","   "," e","18)","External Systems Integration (e.g. BMS, EMS, HVAC, Lighting, API, Cloud)","blank",null,null,null,null,null,null,null,{"$f":"IF(IF(ISNA(INDEX('Application V2'!A:M, MATCH(Application.!A384,'Application V2'!A:A,0),12)), \"\", INDEX('Application V2'!A:M, MATCH(Application.!A384,'Application V2'!A:A,0),12))=0, \"\", IF(ISNA(INDEX('Application V2'!A:M, MATCH(Application.!A384,'Application V2'!A:A,0),12)), \"\", INDEX('Application V2'!A:M, MATCH(Application.!A384,'Application V2'!A:A,0),12)))","v":""},null,null,null,null,null,null,null,"blank"]
[349,385,"\n \n \n \n \n \n","\n \n \n \n \n \n\n\n\n\n\n\n","\n \n \n \n \n \n","\n \n \n \n \n \n","Definition:  The capability to exchange data with other networked systems such as Building or Energy Management Systems (BMS/EMS), Heating Ventilation and Air Conditioning (HVAC) Systems, or other Lighting and Building Systems via BACnet, Modbus, LonWorks or other open protocols, application program interface (API) or other methods. In order to claim this “Reported” capability, the data available from the NLC for exchange with other networked systems must include occupancy status at the zone, space, or area level and energy data at the zone-, circuit- or system-level. The data the NLC can receive and interpret from other networked systems must be digital, that can be used for purposes such as scene control, zones, groups, areas, regions, and/or presets. \nThe method, including formats and languages, by which the system implements this capability must be clearly described in the publicy available reference(s).",null,"blank",null,null,null,null,null,null,null,{"$f":"IF(IF(ISNA(INDEX('Application V2'!A:M, MATCH(Application.!A385,'Application V2'!A:A,0),12)), \"\", INDEX('Application V2'!A:M, MATCH(Application.!A385,'Application V2'!A:A,0),12))=0, \"\", IF(ISNA(INDEX('Application V2'!A:M, MATCH(Application.!A385,'Application V2'!A:A,0),12)), \"\", INDEX('Application V2'!A:M, MATCH(Application.!A385,'Application V2'!A:A,0),12)))","v":""},null,null,null,null,null,null,null,"blank"]
[350,386,"  \n \n","i \n \n","   \n \n"," e\n \n","Does the system have the ability to communicate with other building systems or networks, with instructions for how to configure and/or use this feature?",null,"hasComm","boolean",null,null,null,null,false,{"$f":"IF(O386=TRUE,\"Yes\", \"No\")","v":"No"},{"$f":"IF(IF(ISNA(INDEX('Application V2'!A:M, MATCH(Application.!A386,'Application V2'!A:A,0),12)), \"\", INDEX('Application V2'!A:M, MATCH(Application.!A386,'Application V2'!A:A,0),12))=0, \"\", IF(ISNA(INDEX('Application V2'!A:M, MATCH(Application.!A386,'Application V2'!A:A,0),12)), \"\", INDEX('Application V2'!A:M, MATCH(Application.!A386,'Application V2'!A:A,0),12)))","v":""},null,null,null,null,null,null,null,"hasComm"]
[351,387,"  ","i ","   "," e","What BMS communication protocols are supported? ",null,"commProtocolConcat","concat 388:394",null,null,"Select all that apply",null,null,null,{"$f":"IF(IF(ISNA(INDEX('Application V2'!A:M, MATCH(Application.!A387,'Application V2'!A:A,0),12)), \"\", INDEX('Application V2'!A:M, MATCH(Application.!A387,'Application V2'!A:A,0),12))=0, \"\", IF(ISNA(INDEX('Application V2'!A:M, MATCH(Application.!A387,'Application V2'!A:A,0),12)), \"\", INDEX('Application V2'!A:M, MATCH(Application.!A387,'Application V2'!A:A,0),12)))","v":""},null,null,null,null,null,null,null,"commProtocolConcat"]
[352,388,"  ","i ","   "," e",null,"BACNet® /IP  (ANSI SSPC 135)","commProtocolBACNetIP","boolean",null,null,null,null,false,{"$f":"IF(O388=TRUE,\"Yes\", \"No\")","v":"No"},{"$f":"IF(IF(ISNA(INDEX('Application V2'!A:M, MATCH(Application.!A388,'Application V2'!A:A,0),12)), \"\", INDEX('Application V2'!A:M, MATCH(Application.!A388,'Application V2'!A:A,0),12))=0, \"\", IF(ISNA(INDEX('Application V2'!A:M, MATCH(Application.!A388,'Application V2'!A:A,0),12)), \"\", INDEX('Application V2'!A:M, MATCH(Application.!A388,'Application V2'!A:A,0),12)))","v":""},null,null,null,null,null,null,null,"commProtocolBACNetIP"]
[353,389,"  ","i ","   "," e",null,"Contact closure","commProtocolContactClosure","boolean",null,null,null,null,false,"No",{"$f":"IF(IF(ISNA(INDEX('Application V2'!A:M, MATCH(Application.!A389,'Application V2'!A:A,0),12)), \"\", INDEX('Application V2'!A:M, MATCH(Application.!A389,'Application V2'!A:A,0),12))=0, \"\", IF(ISNA(INDEX('Application V2'!A:M, MATCH(Application.!A389,'Application V2'!A:A,0),12)), \"\", INDEX('Application V2'!A:M, MATCH(Application.!A389,'Application V2'!A:A,0),12)))","v":""},null,null,null,null,null,null,null,"commProtocolContactClosure"]
[354,390,"  ","i ","   "," e",null,"LonWorks FT, LP, PLC, RS-485","commProtocolLonWorks","boolean",null,null,null,null,false,"No",{"$f":"IF(IF(ISNA(INDEX('Application V2'!A:M, MATCH(Application.!A390,'Application V2'!A:A,0),12)), \"\", INDEX('Application V2'!A:M, MATCH(Application.!A390,'Application V2'!A:A,0),12))=0, \"\", IF(ISNA(INDEX('Application V2'!A:M, MATCH(Application.!A390,'Application V2'!A:A,0),12)), \"\", INDEX('Application V2'!A:M, MATCH(Application.!A390,'Application V2'!A:A,0),12)))","v":""},null,null,null,null,null,null,null,"commProtocolLonWorks"]
[356,391,"  ","i ","   "," e",null,"MODBUS® / RS-232, RS-485","commProtocolModbusSerial","boolean",null,null,null,null,false,"No",{"$f":"IF(IF(ISNA(INDEX('Application V2'!A:M, MATCH(Application.!A391,'Application V2'!A:A,0),12)), \"\", INDEX('Application V2'!A:M, MATCH(Application.!A391,'Application V2'!A:A,0),12))=0, \"\", IF(ISNA(INDEX('Application V2'!A:M, MATCH(Application.!A391,'Application V2'!A:A,0),12)), \"\", INDEX('Application V2'!A:M, MATCH(Application.!A391,'Application V2'!A:A,0),12)))","v":""},null,null,null,null,null,null,null,"commProtocolModbusSerial"]
[357,392,"  ","i ","   "," e",null,"MODBUS® TCP/IP","commProtocolModbusTcpip","boolean",null,null,null,null,false,"No",{"$f":"IF(IF(ISNA(INDEX('Application V2'!A:M, MATCH(Application.!A392,'Application V2'!A:A,0),12)), \"\", INDEX('Application V2'!A:M, MATCH(Application.!A392,'Application V2'!A:A,0),12))=0, \"\", IF(ISNA(INDEX('Application V2'!A:M, MATCH(Application.!A392,'Application V2'!A:A,0),12)), \"\", INDEX('Application V2'!A:M, MATCH(Application.!A392,'Application V2'!A:A,0),12)))","v":""},null,null,null,null,null,null,null,"commProtocolModbusTcpip"]
[357.1,393,null,"i ","   "," e",null,"Proprietary:","commProtocolProprietary","boolean",null,null,null,null,false,"No"]
[357.2,394,null,"i ","   "," e",null,"If proprietary, describe briefly(Metasys, Apogee, Structureware, Niagara etc.)","commProtocolProprietaryNotes","text",null,null,null,null,null,{"$f":"IF(ISBLANK(M394),\"\",M394)","v":""}]
[360,395,"  ","i ","   "," e","What components are required? ",null,"commComponents","text",null,null,null,null,null,{"$f":"IF(ISBLANK(M395),\"\",M395)","v":""},{"$f":"IF(IF(ISNA(INDEX('Application V2'!A:M, MATCH(Application.!A395,'Application V2'!A:A,0),12)), \"\", INDEX('Application V2'!A:M, MATCH(Application.!A395,'Application V2'!A:A,0),12))=0, \"\", IF(ISNA(INDEX('Application V2'!A:M, MATCH(Application.!A395,'Application V2'!A:A,0),12)), \"\", INDEX('Application V2'!A:M, MATCH(Application.!A395,'Application V2'!A:A,0),12)))","v":""},null,null,null,null,null,null,null,"commComponents"]
[361,396,"  \n \n","i \n \n","   \n \n"," e\n \n","Are any components of the system certified for compliance with industry standards or specifications? ",null,"commCertified","boolean",null,null,null,null,false,{"$f":"IF(O396=TRUE,\"Yes\", \"No\")","v":"No"},{"$f":"IF(IF(ISNA(INDEX('Application V2'!A:M, MATCH(Application.!A396,'Application V2'!A:A,0),12)), \"\", INDEX('Application V2'!A:M, MATCH(Application.!A396,'Application V2'!A:A,0),12))=0, \"\", IF(ISNA(INDEX('Application V2'!A:M, MATCH(Application.!A396,'Application V2'!A:A,0),12)), \"\", INDEX('Application V2'!A:M, MATCH(Application.!A396,'Application V2'!A:A,0),12)))","v":""},null,null,null,null,null,null,null,"commCertified"]
[362,397,"  ","i ","   "," e",null," If yes, which components and which standards/specifications?","commCertifiedDetails","text",null,null,null,null,null,{"$f":"IF(ISBLANK(M397),\"\",M397)","v":""},{"$f":"IF(IF(ISNA(INDEX('Application V2'!A:M, MATCH(Application.!A397,'Application V2'!A:A,0),12)), \"\", INDEX('Application V2'!A:M, MATCH(Application.!A397,'Application V2'!A:A,0),12))=0, \"\", IF(ISNA(INDEX('Application V2'!A:M, MATCH(Application.!A397,'Application V2'!A:A,0),12)), \"\", INDEX('Application V2'!A:M, MATCH(Application.!A397,'Application V2'!A:A,0),12)))","v":""},null,null,null,null,null,null,null,"commCertifiedDetails"]
[363,398,null,"i"," "," e","What data can be communicated directly with other systems through a BMS communication protocol? ",null,null,null,null,null,"Select all that apply",null,null,null,{"$f":"IF(IF(ISNA(INDEX('Application V2'!A:M, MATCH(Application.!A398,'Application V2'!A:A,0),12)), \"\", INDEX('Application V2'!A:M, MATCH(Application.!A398,'Application V2'!A:A,0),12))=0, \"\", IF(ISNA(INDEX('Application V2'!A:M, MATCH(Application.!A398,'Application V2'!A:A,0),12)), \"\", INDEX('Application V2'!A:M, MATCH(Application.!A398,'Application V2'!A:A,0),12)))","v":""}]
[364,399," ","i","   "," e",null,"System Level Information","dataBmsSystemConcat","concat 400:406",null,null,null,null,null,null,{"$f":"IF(IF(ISNA(INDEX('Application V2'!A:M, MATCH(Application.!A399,'Application V2'!A:A,0),12)), \"\", INDEX('Application V2'!A:M, MATCH(Application.!A399,'Application V2'!A:A,0),12))=0, \"\", IF(ISNA(INDEX('Application V2'!A:M, MATCH(Application.!A399,'Application V2'!A:A,0),12)), \"\", INDEX('Application V2'!A:M, MATCH(Application.!A399,'Application V2'!A:A,0),12)))","v":""},null,null,null,null,null,null,null,"dataBmsSystemConcat"]
[365,400," ","i","   "," e",null,"Energy usage","dataBmsSystemEnergyUsage","boolean",null,null,null,null,false,{"$f":"IF(O400=TRUE,\"Yes\", \"No\")","v":"No"},{"$f":"IF(IF(ISNA(INDEX('Application V2'!A:M, MATCH(Application.!A400,'Application V2'!A:A,0),12)), \"\", INDEX('Application V2'!A:M, MATCH(Application.!A400,'Application V2'!A:A,0),12))=0, \"\", IF(ISNA(INDEX('Application V2'!A:M, MATCH(Application.!A400,'Application V2'!A:A,0),12)), \"\", INDEX('Application V2'!A:M, MATCH(Application.!A400,'Application V2'!A:A,0),12)))","v":""},null,null,null,null,null,null,null,"dataBmsSystemEnergyUsage"]
[366,401," ","i","   "," e",null,"Lighting schedule ","dataBmsSystemLightSchedule ","boolean",null,null,null,null,false,"No",{"$f":"IF(IF(ISNA(INDEX('Application V2'!A:M, MATCH(Application.!A401,'Application V2'!A:A,0),12)), \"\", INDEX('Application V2'!A:M, MATCH(Application.!A401,'Application V2'!A:A,0),12))=0, \"\", IF(ISNA(INDEX('Application V2'!A:M, MATCH(Application.!A401,'Application V2'!A:A,0),12)), \"\", INDEX('Application V2'!A:M, MATCH(Application.!A401,'Application V2'!A:A,0),12)))","v":""},null,null,null,null,null,null,null,"dataBmsSystemLightSchedule "]
[367,402,null,"i","   "," e",null,"Lighting scene setting ","dataBmsSystemLightScene","boolean",null,null,null,null,false,"No",{"$f":"IF(IF(ISNA(INDEX('Application V2'!A:M, MATCH(Application.!A402,'Application V2'!A:A,0),12)), \"\", INDEX('Application V2'!A:M, MATCH(Application.!A402,'Application V2'!A:A,0),12))=0, \"\", IF(ISNA(INDEX('Application V2'!A:M, MATCH(Application.!A402,'Application V2'!A:A,0),12)), \"\", INDEX('Application V2'!A:M, MATCH(Application.!A402,'Application V2'!A:A,0),12)))","v":""},null,null,null,null,null,null,null,"dataBmsSystemLightScene"]
[368,403," ","i","   "," e",null,"Loadshed status","dataBmsSystemStatusDr","boolean",null,null,null,null,false,"No",{"$f":"IF(IF(ISNA(INDEX('Application V2'!A:M, MATCH(Application.!A403,'Application V2'!A:A,0),12)), \"\", INDEX('Application V2'!A:M, MATCH(Application.!A403,'Application V2'!A:A,0),12))=0, \"\", IF(ISNA(INDEX('Application V2'!A:M, MATCH(Application.!A403,'Application V2'!A:A,0),12)), \"\", INDEX('Application V2'!A:M, MATCH(Application.!A403,'Application V2'!A:A,0),12)))","v":""},null,null,null,null,null,null,null,"dataBmsSystemStatusDr"]
[369,404," ","i","   "," e",null,"Manual override status","dataBmsSystemStatusOverride","boolean",null,null,null,null,false,"No",{"$f":"IF(IF(ISNA(INDEX('Application V2'!A:M, MATCH(Application.!A404,'Application V2'!A:A,0),12)), \"\", INDEX('Application V2'!A:M, MATCH(Application.!A404,'Application V2'!A:A,0),12))=0, \"\", IF(ISNA(INDEX('Application V2'!A:M, MATCH(Application.!A404,'Application V2'!A:A,0),12)), \"\", INDEX('Application V2'!A:M, MATCH(Application.!A404,'Application V2'!A:A,0),12)))","v":""},null,null,null,null,null,null,null,"dataBmsSystemStatusOverride"]
[370,405," ","i","   "," e",null,"Occupancy status","dataBmsSystemStatusOcc","boolean",null,null,null,null,false,"No",{"$f":"IF(IF(ISNA(INDEX('Application V2'!A:M, MATCH(Application.!A405,'Application V2'!A:A,0),12)), \"\", INDEX('Application V2'!A:M, MATCH(Application.!A405,'Application V2'!A:A,0),12))=0, \"\", IF(ISNA(INDEX('Application V2'!A:M, MATCH(Application.!A405,'Application V2'!A:A,0),12)), \"\", INDEX('Application V2'!A:M, MATCH(Application.!A405,'Application V2'!A:A,0),12)))","v":""},null,null,null,null,null,null,null,"dataBmsSystemStatusOcc"]
[371,406,null,"i","   "," e",null,"Other (explain)","dataBmsSystemOther","text",null,null,null,null,null,{"$f":"IF(ISBLANK(M406),\"\",M406)","v":""},{"$f":"IF(IF(ISNA(INDEX('Application V2'!A:M, MATCH(Application.!A406,'Application V2'!A:A,0),12)), \"\", INDEX('Application V2'!A:M, MATCH(Application.!A406,'Application V2'!A:A,0),12))=0, \"\", IF(ISNA(INDEX('Application V2'!A:M, MATCH(Application.!A406,'Application V2'!A:A,0),12)), \"\", INDEX('Application V2'!A:M, MATCH(Application.!A406,'Application V2'!A:A,0),12)))","v":""},null,null,null,null,null,null,null,"dataBmsSystemOther"]
[372,407,null,"i","   "," e",null,"Zone Level Information","dataBmsZoneConcat","concat 408:419",null,null,null,null,null,null,{"$f":"IF(IF(ISNA(INDEX('Application V2'!A:M, MATCH(Application.!A407,'Application V2'!A:A,0),12)), \"\", INDEX('Application V2'!A:M, MATCH(Application.!A407,'Application V2'!A:A,0),12))=0, \"\", IF(ISNA(INDEX('Application V2'!A:M, MATCH(Application.!A407,'Application V2'!A:A,0),12)), \"\", INDEX('Application V2'!A:M, MATCH(Application.!A407,'Application V2'!A:A,0),12)))","v":""},null,null,null,null,null,null,null,"dataBmsZoneConcat"]
[373,408,null,"i","   "," e",null,"Control strategy","dataBmsZoneControlStrategy","boolean",null,null,null,null,false,{"$f":"IF(O408=TRUE,\"Yes\", \"No\")","v":"No"},{"$f":"IF(IF(ISNA(INDEX('Application V2'!A:M, MATCH(Application.!A408,'Application V2'!A:A,0),12)), \"\", INDEX('Application V2'!A:M, MATCH(Application.!A408,'Application V2'!A:A,0),12))=0, \"\", IF(ISNA(INDEX('Application V2'!A:M, MATCH(Application.!A408,'Application V2'!A:A,0),12)), \"\", INDEX('Application V2'!A:M, MATCH(Application.!A408,'Application V2'!A:A,0),12)))","v":""},null,null,null,null,null,null,null,"dataBmsZoneControlStrategy"]
[374,409,null,"i","   "," e",null,"Energy usage","dataBmsZoneEnergyUsage","boolean",null,null,null,null,false,"No",{"$f":"IF(IF(ISNA(INDEX('Application V2'!A:M, MATCH(Application.!A409,'Application V2'!A:A,0),12)), \"\", INDEX('Application V2'!A:M, MATCH(Application.!A409,'Application V2'!A:A,0),12))=0, \"\", IF(ISNA(INDEX('Application V2'!A:M, MATCH(Application.!A409,'Application V2'!A:A,0),12)), \"\", INDEX('Application V2'!A:M, MATCH(Application.!A409,'Application V2'!A:A,0),12)))","v":""},null,null,null,null,null,null,null,"dataBmsZoneEnergyUsage"]
[375,410,null,"i","   "," e",null,"Light level","dataBmsZoneLightLevel","boolean",null,null,null,null,false,"No",{"$f":"IF(IF(ISNA(INDEX('Application V2'!A:M, MATCH(Application.!A410,'Application V2'!A:A,0),12)), \"\", INDEX('Application V2'!A:M, MATCH(Application.!A410,'Application V2'!A:A,0),12))=0, \"\", IF(ISNA(INDEX('Application V2'!A:M, MATCH(Application.!A410,'Application V2'!A:A,0),12)), \"\", INDEX('Application V2'!A:M, MATCH(Application.!A410,'Application V2'!A:A,0),12)))","v":""},null,null,null,null,null,null,null,"dataBmsZoneLightLevel"]
[376,411,null,"i","   "," e",null,"Manual override status","dataBmsZoneStausOverride","boolean",null,null,null,null,false,"No",{"$f":"IF(IF(ISNA(INDEX('Application V2'!A:M, MATCH(Application.!A411,'Application V2'!A:A,0),12)), \"\", INDEX('Application V2'!A:M, MATCH(Application.!A411,'Application V2'!A:A,0),12))=0, \"\", IF(ISNA(INDEX('Application V2'!A:M, MATCH(Application.!A411,'Application V2'!A:A,0),12)), \"\", INDEX('Application V2'!A:M, MATCH(Application.!A411,'Application V2'!A:A,0),12)))","v":""},null,null,null,null,null,null,null,"dataBmsZoneStausOverride"]
[377,412,null,"i","   "," e",null,"Occupancy status","dataBmsZoneStatusOcc","boolean",null,null,null,null,false,"No",{"$f":"IF(IF(ISNA(INDEX('Application V2'!A:M, MATCH(Application.!A412,'Application V2'!A:A,0),12)), \"\", INDEX('Application V2'!A:M, MATCH(Application.!A412,'Application V2'!A:A,0),12))=0, \"\", IF(ISNA(INDEX('Application V2'!A:M, MATCH(Application.!A412,'Application V2'!A:A,0),12)), \"\", INDEX('Application V2'!A:M, MATCH(Application.!A412,'Application V2'!A:A,0),12)))","v":""},null,null,null,null,null,null,null,"dataBmsZoneStatusOcc"]
[378,413,null,"i","   "," e",null,"Lighting scene setting ","dataBmsZoneLightScene","boolean",null,null,null,null,false,"No",{"$f":"IF(IF(ISNA(INDEX('Application V2'!A:M, MATCH(Application.!A413,'Application V2'!A:A,0),12)), \"\", INDEX('Application V2'!A:M, MATCH(Application.!A413,'Application V2'!A:A,0),12))=0, \"\", IF(ISNA(INDEX('Application V2'!A:M, MATCH(Application.!A413,'Application V2'!A:A,0),12)), \"\", INDEX('Application V2'!A:M, MATCH(Application.!A413,'Application V2'!A:A,0),12)))","v":""},null,null,null,null,null,null,null,"dataBmsZoneLightScene"]
[379,414," ","i","   "," e",null,"Operation and fan modes","dataBmsZoneFanModes","boolean",null,null,null,null,false,"No",{"$f":"IF(IF(ISNA(INDEX('Application V2'!A:M, MATCH(Application.!A414,'Application V2'!A:A,0),12)), \"\", INDEX('Application V2'!A:M, MATCH(Application.!A414,'Application V2'!A:A,0),12))=0, \"\", IF(ISNA(INDEX('Application V2'!A:M, MATCH(Application.!A414,'Application V2'!A:A,0),12)), \"\", INDEX('Application V2'!A:M, MATCH(Application.!A414,'Application V2'!A:A,0),12)))","v":""},null,null,null,null,null,null,null,"dataBmsZoneFanModes"]
[380,415," ","i","   "," e",null,"Remote sensor data","dataBmsZoneSensor","boolean",null,null,null,null,false,"No",{"$f":"IF(IF(ISNA(INDEX('Application V2'!A:M, MATCH(Application.!A415,'Application V2'!A:A,0),12)), \"\", INDEX('Application V2'!A:M, MATCH(Application.!A415,'Application V2'!A:A,0),12))=0, \"\", IF(ISNA(INDEX('Application V2'!A:M, MATCH(Application.!A415,'Application V2'!A:A,0),12)), \"\", INDEX('Application V2'!A:M, MATCH(Application.!A415,'Application V2'!A:A,0),12)))","v":""},null,null,null,null,null,null,null,"dataBmsZoneSensor"]
[381,416," ","i","   "," e",null,"Temperature set point ","dataBmsZoneTstatSetPoint ","boolean",null,null,null,null,false,"No",{"$f":"IF(IF(ISNA(INDEX('Application V2'!A:M, MATCH(Application.!A416,'Application V2'!A:A,0),12)), \"\", INDEX('Application V2'!A:M, MATCH(Application.!A416,'Application V2'!A:A,0),12))=0, \"\", IF(ISNA(INDEX('Application V2'!A:M, MATCH(Application.!A416,'Application V2'!A:A,0),12)), \"\", INDEX('Application V2'!A:M, MATCH(Application.!A416,'Application V2'!A:A,0),12)))","v":""},null,null,null,null,null,null,null,"dataBmsZoneTstatSetPoint "]
[382,417," ","i","   "," e",null,"Thermostat status","dataBmsZoneStatusTstat","boolean",null,null,null,null,false,"No",{"$f":"IF(IF(ISNA(INDEX('Application V2'!A:M, MATCH(Application.!A417,'Application V2'!A:A,0),12)), \"\", INDEX('Application V2'!A:M, MATCH(Application.!A417,'Application V2'!A:A,0),12))=0, \"\", IF(ISNA(INDEX('Application V2'!A:M, MATCH(Application.!A417,'Application V2'!A:A,0),12)), \"\", INDEX('Application V2'!A:M, MATCH(Application.!A417,'Application V2'!A:A,0),12)))","v":""},null,null,null,null,null,null,null,"dataBmsZoneStatusTstat"]
[383,418," ","i","   "," e",null,"User inputs","dataBmsZoneUserInputs","boolean",null,null,null,null,false,"No",{"$f":"IF(IF(ISNA(INDEX('Application V2'!A:M, MATCH(Application.!A418,'Application V2'!A:A,0),12)), \"\", INDEX('Application V2'!A:M, MATCH(Application.!A418,'Application V2'!A:A,0),12))=0, \"\", IF(ISNA(INDEX('Application V2'!A:M, MATCH(Application.!A418,'Application V2'!A:A,0),12)), \"\", INDEX('Application V2'!A:M, MATCH(Application.!A418,'Application V2'!A:A,0),12)))","v":""},null,null,null,null,null,null,null,"dataBmsZoneUserInputs"]
[384,419," ","i","   "," e",null,"Other (explain)","dataBmsZoneOther","text",null,null,null,null,{"$f":"M419","v":0},{"$f":"IF(ISBLANK(M419),\"\",M419)","v":""},{"$f":"IF(IF(ISNA(INDEX('Application V2'!A:M, MATCH(Application.!A419,'Application V2'!A:A,0),12)), \"\", INDEX('Application V2'!A:M, MATCH(Application.!A419,'Application V2'!A:A,0),12))=0, \"\", IF(ISNA(INDEX('Application V2'!A:M, MATCH(Application.!A419,'Application V2'!A:A,0),12)), \"\", INDEX('Application V2'!A:M, MATCH(Application.!A419,'Application V2'!A:A,0),12)))","v":""},null,null,null,null,null,null,null,"dataBmsZoneOther"]
[385,420,null,"i","   "," e",null,"Luminaire Level Information","dataBmsLuminaireConcat","concat 421:425",null,null,null,null,null,null,{"$f":"IF(IF(ISNA(INDEX('Application V2'!A:M, MATCH(Application.!A420,'Application V2'!A:A,0),12)), \"\", INDEX('Application V2'!A:M, MATCH(Application.!A420,'Application V2'!A:A,0),12))=0, \"\", IF(ISNA(INDEX('Application V2'!A:M, MATCH(Application.!A420,'Application V2'!A:A,0),12)), \"\", INDEX('Application V2'!A:M, MATCH(Application.!A420,'Application V2'!A:A,0),12)))","v":""},null,null,null,null,null,null,null,"dataBmsLuminaireConcat"]
[386,421,null,"i","   "," e",null,"Energy usage","dataBmsLuminaireEnergyUsage","boolean",null,null,null,null,false,{"$f":"IF(O421=TRUE,\"Yes\", \"No\")","v":"No"},{"$f":"IF(IF(ISNA(INDEX('Application V2'!A:M, MATCH(Application.!A421,'Application V2'!A:A,0),12)), \"\", INDEX('Application V2'!A:M, MATCH(Application.!A421,'Application V2'!A:A,0),12))=0, \"\", IF(ISNA(INDEX('Application V2'!A:M, MATCH(Application.!A421,'Application V2'!A:A,0),12)), \"\", INDEX('Application V2'!A:M, MATCH(Application.!A421,'Application V2'!A:A,0),12)))","v":""},null,null,null,null,null,null,null,"dataBmsLuminaireEnergyUsage"]
[387,422,null,"i","   "," e",null,"Light level","dataBmsLuminaireLightLevel","boolean",null,null,null,null,false,{"$f":"IF(O422=TRUE,\"Yes\", \"No\")","v":"No"},{"$f":"IF(IF(ISNA(INDEX('Application V2'!A:M, MATCH(Application.!A422,'Application V2'!A:A,0),12)), \"\", INDEX('Application V2'!A:M, MATCH(Application.!A422,'Application V2'!A:A,0),12))=0, \"\", IF(ISNA(INDEX('Application V2'!A:M, MATCH(Application.!A422,'Application V2'!A:A,0),12)), \"\", INDEX('Application V2'!A:M, MATCH(Application.!A422,'Application V2'!A:A,0),12)))","v":""},null,null,null,null,null,null,null,"dataBmsLuminaireLightLevel"]
[388,423,null,"i","   "," e",null,"Occupancy status","dataBmsLuminaireStatusOcc","boolean",null,null,null,null,false,{"$f":"IF(O423=TRUE,\"Yes\", \"No\")","v":"No"},{"$f":"IF(IF(ISNA(INDEX('Application V2'!A:M, MATCH(Application.!A423,'Application V2'!A:A,0),12)), \"\", INDEX('Application V2'!A:M, MATCH(Application.!A423,'Application V2'!A:A,0),12))=0, \"\", IF(ISNA(INDEX('Application V2'!A:M, MATCH(Application.!A423,'Application V2'!A:A,0),12)), \"\", INDEX('Application V2'!A:M, MATCH(Application.!A423,'Application V2'!A:A,0),12)))","v":""},null,null,null,null,null,null,null,"dataBmsLuminaireStatusOcc"]
[389,424,null,"i","   "," e",null,"Luminaire/power pack status","dataBmsLuminaireStatus","boolean",null,null,null,null,false,{"$f":"IF(O424=TRUE,\"Yes\", \"No\")","v":"No"},{"$f":"IF(IF(ISNA(INDEX('Application V2'!A:M, MATCH(Application.!A424,'Application V2'!A:A,0),12)), \"\", INDEX('Application V2'!A:M, MATCH(Application.!A424,'Application V2'!A:A,0),12))=0, \"\", IF(ISNA(INDEX('Application V2'!A:M, MATCH(Application.!A424,'Application V2'!A:A,0),12)), \"\", INDEX('Application V2'!A:M, MATCH(Application.!A424,'Application V2'!A:A,0),12)))","v":""},null,null,null,null,null,null,null,"dataBmsLuminaireStatus"]
[390,425,null,"i","   "," e",null,"Other (explain)","dataBmsLuminaireOther","text",null,null,null,null,null,{"$f":"IF(ISBLANK(M425),\"\",M425)","v":""},{"$f":"IF(IF(ISNA(INDEX('Application V2'!A:M, MATCH(Application.!A425,'Application V2'!A:A,0),12)), \"\", INDEX('Application V2'!A:M, MATCH(Application.!A425,'Application V2'!A:A,0),12))=0, \"\", IF(ISNA(INDEX('Application V2'!A:M, MATCH(Application.!A425,'Application V2'!A:A,0),12)), \"\", INDEX('Application V2'!A:M, MATCH(Application.!A425,'Application V2'!A:A,0),12)))","v":""},null,null,null,null,null,null,null,"dataBmsLuminaireOther"]
[391,426,null,"i",null,"e","What, if any, custom BACnet objects are provided?",null,"dataBmsCustom","text",null,null,null,null,null,{"$f":"IF(ISBLANK(M426),\"\",M426)","v":""},null,null,null,null,null,null,null,null,"dataBmsCustom"]
[392,427,null,"i","   "," e","Does the system accept input of operational commands via BMS?",null,"bmsInputCommands","boolean",null,null,null,null,false,{"$f":"IF(O427=TRUE,\"Yes\", \"No\")","v":"No"},{"$f":"IF(IF(ISNA(INDEX('Application V2'!A:M, MATCH(Application.!A427,'Application V2'!A:A,0),12)), \"\", INDEX('Application V2'!A:M, MATCH(Application.!A427,'Application V2'!A:A,0),12))=0, \"\", IF(ISNA(INDEX('Application V2'!A:M, MATCH(Application.!A427,'Application V2'!A:A,0),12)), \"\", INDEX('Application V2'!A:M, MATCH(Application.!A427,'Application V2'!A:A,0),12)))","v":""},null,null,null,null,null,null,null,"bmsInputCommands"]
[393,428,null,"i","   "," e",null,"If so, describe the response time for a lighting scene change request communicated by an external system via BMS protocol.","bmsSceneChangeTime","text",null,null,null,null,null,{"$f":"IF(ISBLANK(M428),\"\",M428)","v":""},{"$f":"IF(IF(ISNA(INDEX('Application V2'!A:M, MATCH(Application.!A428,'Application V2'!A:A,0),12)), \"\", INDEX('Application V2'!A:M, MATCH(Application.!A428,'Application V2'!A:A,0),12))=0, \"\", IF(ISNA(INDEX('Application V2'!A:M, MATCH(Application.!A428,'Application V2'!A:A,0),12)), \"\", INDEX('Application V2'!A:M, MATCH(Application.!A428,'Application V2'!A:A,0),12)))","v":""},null,null,null,null,null,null,null,"bmsSceneChangeTime"]
[394,429,null,"i","   "," e","Does the system provide an API?",null,"hasApi","boolean",null,null,null,null,false,{"$f":"IF(O429=TRUE,\"Yes\", \"No\")","v":"No"},{"$f":"IF(IF(ISNA(INDEX('Application V2'!A:M, MATCH(Application.!A429,'Application V2'!A:A,0),12)), \"\", INDEX('Application V2'!A:M, MATCH(Application.!A429,'Application V2'!A:A,0),12))=0, \"\", IF(ISNA(INDEX('Application V2'!A:M, MATCH(Application.!A429,'Application V2'!A:A,0),12)), \"\", INDEX('Application V2'!A:M, MATCH(Application.!A429,'Application V2'!A:A,0),12)))","v":""},null,null,null,null,null,null,null,"hasApi"]
[395,430,null,"i"," "," e","What data can be communicated with other systems through an API?",null,"blank",null,null,null,"Select all that apply",null,null,null,{"$f":"IF(IF(ISNA(INDEX('Application V2'!A:M, MATCH(Application.!A430,'Application V2'!A:A,0),12)), \"\", INDEX('Application V2'!A:M, MATCH(Application.!A430,'Application V2'!A:A,0),12))=0, \"\", IF(ISNA(INDEX('Application V2'!A:M, MATCH(Application.!A430,'Application V2'!A:A,0),12)), \"\", INDEX('Application V2'!A:M, MATCH(Application.!A430,'Application V2'!A:A,0),12)))","v":""},null,null,null,null,null,null,null,"blank"]
[396,431," ","i","   "," e",null,"System Level Information","dataApiSystemConcat","concat 432:438",null,null,null,null,null,null,{"$f":"IF(IF(ISNA(INDEX('Application V2'!A:M, MATCH(Application.!A431,'Application V2'!A:A,0),12)), \"\", INDEX('Application V2'!A:M, MATCH(Application.!A431,'Application V2'!A:A,0),12))=0, \"\", IF(ISNA(INDEX('Application V2'!A:M, MATCH(Application.!A431,'Application V2'!A:A,0),12)), \"\", INDEX('Application V2'!A:M, MATCH(Application.!A431,'Application V2'!A:A,0),12)))","v":""},null,null,null,null,null,null,null,"dataApiSystemConcat"]
[397,432," ","i","   "," e",null,"Energy usage","dataApiSystemEnergyUsage","boolean",null,null,null,null,false,{"$f":"IF(O432=TRUE,\"Yes\", \"No\")","v":"No"},{"$f":"IF(IF(ISNA(INDEX('Application V2'!A:M, MATCH(Application.!A432,'Application V2'!A:A,0),12)), \"\", INDEX('Application V2'!A:M, MATCH(Application.!A432,'Application V2'!A:A,0),12))=0, \"\", IF(ISNA(INDEX('Application V2'!A:M, MATCH(Application.!A432,'Application V2'!A:A,0),12)), \"\", INDEX('Application V2'!A:M, MATCH(Application.!A432,'Application V2'!A:A,0),12)))","v":""},null,null,null,null,null,null,null,"dataApiSystemEnergyUsage"]
[398,433," ","i","   "," e",null,"Lighting schedule ","dataApiSystemLightSchedule ","boolean",null,null,null,null,false,"No",{"$f":"IF(IF(ISNA(INDEX('Application V2'!A:M, MATCH(Application.!A433,'Application V2'!A:A,0),12)), \"\", INDEX('Application V2'!A:M, MATCH(Application.!A433,'Application V2'!A:A,0),12))=0, \"\", IF(ISNA(INDEX('Application V2'!A:M, MATCH(Application.!A433,'Application V2'!A:A,0),12)), \"\", INDEX('Application V2'!A:M, MATCH(Application.!A433,'Application V2'!A:A,0),12)))","v":""},null,null,null,null,null,null,null,"dataApiSystemLightSchedule "]
[399,434,null,"i","   "," e",null,"Lighting scene setting ","dataApiSystemLightScene","boolean",null,null,null,null,false,"No",{"$f":"IF(IF(ISNA(INDEX('Application V2'!A:M, MATCH(Application.!A434,'Application V2'!A:A,0),12)), \"\", INDEX('Application V2'!A:M, MATCH(Application.!A434,'Application V2'!A:A,0),12))=0, \"\", IF(ISNA(INDEX('Application V2'!A:M, MATCH(Application.!A434,'Application V2'!A:A,0),12)), \"\", INDEX('Application V2'!A:M, MATCH(Application.!A434,'Application V2'!A:A,0),12)))","v":""},null,null,null,null,null,null,null,"dataApiSystemLightScene"]
[400,435," ","i","   "," e",null,"Loadshed status","dataApiSystemStatusDr","boolean",null,null,null,null,false,"No",{"$f":"IF(IF(ISNA(INDEX('Application V2'!A:M, MATCH(Application.!A435,'Application V2'!A:A,0),12)), \"\", INDEX('Application V2'!A:M, MATCH(Application.!A435,'Application V2'!A:A,0),12))=0, \"\", IF(ISNA(INDEX('Application V2'!A:M, MATCH(Application.!A435,'Application V2'!A:A,0),12)), \"\", INDEX('Application V2'!A:M, MATCH(Application.!A435,'Application V2'!A:A,0),12)))","v":""},null,null,null,null,null,null,null,"dataApiSystemStatusDr"]
[401,436," ","i","   "," e",null,"Manual override status","dataApiSystemStatusOverride","boolean",null,null,null,null,false,"No",{"$f":"IF(IF(ISNA(INDEX('Application V2'!A:M, MATCH(Application.!A436,'Application V2'!A:A,0),12)), \"\", INDEX('Application V2'!A:M, MATCH(Application.!A436,'Application V2'!A:A,0),12))=0, \"\", IF(ISNA(INDEX('Application V2'!A:M, MATCH(Application.!A436,'Application V2'!A:A,0),12)), \"\", INDEX('Application V2'!A:M, MATCH(Application.!A436,'Application V2'!A:A,0),12)))","v":""},null,null,null,null,null,null,null,"dataApiSystemStatusOverride"]
[402,437," ","i","   "," e",null,"Occupancy status","dataApiSystemStatusOcc","boolean",null,null,null,null,false,"No",{"$f":"IF(IF(ISNA(INDEX('Application V2'!A:M, MATCH(Application.!A437,'Application V2'!A:A,0),12)), \"\", INDEX('Application V2'!A:M, MATCH(Application.!A437,'Application V2'!A:A,0),12))=0, \"\", IF(ISNA(INDEX('Application V2'!A:M, MATCH(Application.!A437,'Application V2'!A:A,0),12)), \"\", INDEX('Application V2'!A:M, MATCH(Application.!A437,'Application V2'!A:A,0),12)))","v":""},null,null,null,null,null,null,null,"dataApiSystemStatusOcc"]
[403,438,null,"i","   "," e",null,"Other (explain)","dataApiSystemOther","text",null,null,null,null,null,{"$f":"IF(ISBLANK(M438),\"\",M438)","v":""},{"$f":"IF(IF(ISNA(INDEX('Application V2'!A:M, MATCH(Application.!A438,'Application V2'!A:A,0),12)), \"\", INDEX('Application V2'!A:M, MATCH(Application.!A438,'Application V2'!A:A,0),12))=0, \"\", IF(ISNA(INDEX('Application V2'!A:M, MATCH(Application.!A438,'Application V2'!A:A,0),12)), \"\", INDEX('Application V2'!A:M, MATCH(Application.!A438,'Application V2'!A:A,0),12)))","v":""},null,null,null,null,null,null,null,"dataApiSystemOther"]
[404,439,null,"i","   "," e",null,"Zone Level Information","dataApiZoneConcat","concat 440:451",null,null,null,null,null,null,{"$f":"IF(IF(ISNA(INDEX('Application V2'!A:M, MATCH(Application.!A439,'Application V2'!A:A,0),12)), \"\", INDEX('Application V2'!A:M, MATCH(Application.!A439,'Application V2'!A:A,0),12))=0, \"\", IF(ISNA(INDEX('Application V2'!A:M, MATCH(Application.!A439,'Application V2'!A:A,0),12)), \"\", INDEX('Application V2'!A:M, MATCH(Application.!A439,'Application V2'!A:A,0),12)))","v":""},null,null,null,null,null,null,null,"dataApiZoneConcat"]
[405,440,null,"i","   "," e",null,"Control strategy","dataApiZoneControlStrategy","boolean",null,null,null,null,false,{"$f":"IF(O440=TRUE,\"Yes\", \"No\")","v":"No"},{"$f":"IF(IF(ISNA(INDEX('Application V2'!A:M, MATCH(Application.!A440,'Application V2'!A:A,0),12)), \"\", INDEX('Application V2'!A:M, MATCH(Application.!A440,'Application V2'!A:A,0),12))=0, \"\", IF(ISNA(INDEX('Application V2'!A:M, MATCH(Application.!A440,'Application V2'!A:A,0),12)), \"\", INDEX('Application V2'!A:M, MATCH(Application.!A440,'Application V2'!A:A,0),12)))","v":""},null,null,null,null,null,null,null,"dataApiZoneControlStrategy"]
[406,441,null,"i","   "," e",null,"Energy usage","dataApiZoneEnergyUsage","boolean",null,null,null,null,false,"No",{"$f":"IF(IF(ISNA(INDEX('Application V2'!A:M, MATCH(Application.!A441,'Application V2'!A:A,0),12)), \"\", INDEX('Application V2'!A:M, MATCH(Application.!A441,'Application V2'!A:A,0),12))=0, \"\", IF(ISNA(INDEX('Application V2'!A:M, MATCH(Application.!A441,'Application V2'!A:A,0),12)), \"\", INDEX('Application V2'!A:M, MATCH(Application.!A441,'Application V2'!A:A,0),12)))","v":""},null,null,null,null,null,null,null,"dataApiZoneEnergyUsage"]
[407,442,null,"i","   "," e",null,"Light level","dataApiZoneLightLevel","boolean",null,null,null,null,false,"No",{"$f":"IF(IF(ISNA(INDEX('Application V2'!A:M, MATCH(Application.!A442,'Application V2'!A:A,0),12)), \"\", INDEX('Application V2'!A:M, MATCH(Application.!A442,'Application V2'!A:A,0),12))=0, \"\", IF(ISNA(INDEX('Application V2'!A:M, MATCH(Application.!A442,'Application V2'!A:A,0),12)), \"\", INDEX('Application V2'!A:M, MATCH(Application.!A442,'Application V2'!A:A,0),12)))","v":""},null,null,null,null,null,null,null,"dataApiZoneLightLevel"]
[408,443,null,"i","   "," e",null,"Manual override status","dataApiZoneStausOverride","boolean",null,null,null,null,false,"No",{"$f":"IF(IF(ISNA(INDEX('Application V2'!A:M, MATCH(Application.!A443,'Application V2'!A:A,0),12)), \"\", INDEX('Application V2'!A:M, MATCH(Application.!A443,'Application V2'!A:A,0),12))=0, \"\", IF(ISNA(INDEX('Application V2'!A:M, MATCH(Application.!A443,'Application V2'!A:A,0),12)), \"\", INDEX('Application V2'!A:M, MATCH(Application.!A443,'Application V2'!A:A,0),12)))","v":""},null,null,null,null,null,null,null,"dataApiZoneStausOverride"]
[409,444,null,"i","   "," e",null,"Occupancy status","dataApiZoneStatusOcc","boolean",null,null,null,null,false,"No",{"$f":"IF(IF(ISNA(INDEX('Application V2'!A:M, MATCH(Application.!A444,'Application V2'!A:A,0),12)), \"\", INDEX('Application V2'!A:M, MATCH(Application.!A444,'Application V2'!A:A,0),12))=0, \"\", IF(ISNA(INDEX('Application V2'!A:M, MATCH(Application.!A444,'Application V2'!A:A,0),12)), \"\", INDEX('Application V2'!A:M, MATCH(Application.!A444,'Application V2'!A:A,0),12)))","v":""},null,null,null,null,null,null,null,"dataApiZoneStatusOcc"]
[410,445,null,"i","   "," e",null,"Lighting scene setting ","dataApiZoneLightScene","boolean",null,null,null,null,false,"No",{"$f":"IF(IF(ISNA(INDEX('Application V2'!A:M, MATCH(Application.!A445,'Application V2'!A:A,0),12)), \"\", INDEX('Application V2'!A:M, MATCH(Application.!A445,'Application V2'!A:A,0),12))=0, \"\", IF(ISNA(INDEX('Application V2'!A:M, MATCH(Application.!A445,'Application V2'!A:A,0),12)), \"\", INDEX('Application V2'!A:M, MATCH(Application.!A445,'Application V2'!A:A,0),12)))","v":""},null,null,null,null,null,null,null,"dataApiZoneLightScene"]
[411,446," ","i","   "," e",null,"Operation and fan modes","dataApiZoneFanModes","boolean",null,null,null,null,false,"No",{"$f":"IF(IF(ISNA(INDEX('Application V2'!A:M, MATCH(Application.!A446,'Application V2'!A:A,0),12)), \"\", INDEX('Application V2'!A:M, MATCH(Application.!A446,'Application V2'!A:A,0),12))=0, \"\", IF(ISNA(INDEX('Application V2'!A:M, MATCH(Application.!A446,'Application V2'!A:A,0),12)), \"\", INDEX('Application V2'!A:M, MATCH(Application.!A446,'Application V2'!A:A,0),12)))","v":""},null,null,null,null,null,null,null,"dataApiZoneFanModes"]
[412,447," ","i","   "," e",null,"Remote sensor data","dataApiZoneSensor","boolean",null,null,null,null,false,"No",{"$f":"IF(IF(ISNA(INDEX('Application V2'!A:M, MATCH(Application.!A447,'Application V2'!A:A,0),12)), \"\", INDEX('Application V2'!A:M, MATCH(Application.!A447,'Application V2'!A:A,0),12))=0, \"\", IF(ISNA(INDEX('Application V2'!A:M, MATCH(Application.!A447,'Application V2'!A:A,0),12)), \"\", INDEX('Application V2'!A:M, MATCH(Application.!A447,'Application V2'!A:A,0),12)))","v":""},null,null,null,null,null,null,null,"dataApiZoneSensor"]
[413,448," ","i","   "," e",null,"Temperature set point ","dataApiZoneTstatSetPoint ","boolean",null,null,null,null,false,"No",{"$f":"IF(IF(ISNA(INDEX('Application V2'!A:M, MATCH(Application.!A448,'Application V2'!A:A,0),12)), \"\", INDEX('Application V2'!A:M, MATCH(Application.!A448,'Application V2'!A:A,0),12))=0, \"\", IF(ISNA(INDEX('Application V2'!A:M, MATCH(Application.!A448,'Application V2'!A:A,0),12)), \"\", INDEX('Application V2'!A:M, MATCH(Application.!A448,'Application V2'!A:A,0),12)))","v":""},null,null,null,null,null,null,null,"dataApiZoneTstatSetPoint "]
[414,449," ","i","   "," e",null,"Thermostat status","dataApiZoneStatusTstat","boolean",null,null,null,null,false,"No",{"$f":"IF(IF(ISNA(INDEX('Application V2'!A:M, MATCH(Application.!A449,'Application V2'!A:A,0),12)), \"\", INDEX('Application V2'!A:M, MATCH(Application.!A449,'Application V2'!A:A,0),12))=0, \"\", IF(ISNA(INDEX('Application V2'!A:M, MATCH(Application.!A449,'Application V2'!A:A,0),12)), \"\", INDEX('Application V2'!A:M, MATCH(Application.!A449,'Application V2'!A:A,0),12)))","v":""},null,null,null,null,null,null,null,"dataApiZoneStatusTstat"]
[415,450," ","i","   "," e",null,"User inputs","dataApiZoneUserInputs","boolean",null,null,null,null,false,"No",{"$f":"IF(IF(ISNA(INDEX('Application V2'!A:M, MATCH(Application.!A450,'Application V2'!A:A,0),12)), \"\", INDEX('Application V2'!A:M, MATCH(Application.!A450,'Application V2'!A:A,0),12))=0, \"\", IF(ISNA(INDEX('Application V2'!A:M, MATCH(Application.!A450,'Application V2'!A:A,0),12)), \"\", INDEX('Application V2'!A:M, MATCH(Application.!A450,'Application V2'!A:A,0),12)))","v":""},null,null,null,null,null,null,null,"dataApiZoneUserInputs"]
[416,451," ","i","   "," e",null,"Other (explain)","dataApiZoneOther","text",null,null,null,null,null,{"$f":"IF(ISBLANK(M451),\"\",M451)","v":""},{"$f":"IF(IF(ISNA(INDEX('Application V2'!A:M, MATCH(Application.!A451,'Application V2'!A:A,0),12)), \"\", INDEX('Application V2'!A:M, MATCH(Application.!A451,'Application V2'!A:A,0),12))=0, \"\", IF(ISNA(INDEX('Application V2'!A:M, MATCH(Application.!A451,'Application V2'!A:A,0),12)), \"\", INDEX('Application V2'!A:M, MATCH(Application.!A451,'Application V2'!A:A,0),12)))","v":""},null,null,null,null,null,null,null,"dataApiZoneOther"]
[417,452,null,"i","   "," e",null,"Luminaire Level Information","dataApiLuminaireconcat","concat 453:457",null,null,null,null,null,null,{"$f":"IF(IF(ISNA(INDEX('Application V2'!A:M, MATCH(Application.!A452,'Application V2'!A:A,0),12)), \"\", INDEX('Application V2'!A:M, MATCH(Application.!A452,'Application V2'!A:A,0),12))=0, \"\", IF(ISNA(INDEX('Application V2'!A:M, MATCH(Application.!A452,'Application V2'!A:A,0),12)), \"\", INDEX('Application V2'!A:M, MATCH(Application.!A452,'Application V2'!A:A,0),12)))","v":""},null,null,null,null,null,null,null,"dataApiLuminaireconcat"]
[418,453,null,"i","   "," e",null,"Energy usage","dataApiLuminaireEnergyUsage","boolean",null,null,null,null,false,{"$f":"IF(O453=TRUE,\"Yes\", \"No\")","v":"No"},{"$f":"IF(IF(ISNA(INDEX('Application V2'!A:M, MATCH(Application.!A453,'Application V2'!A:A,0),12)), \"\", INDEX('Application V2'!A:M, MATCH(Application.!A453,'Application V2'!A:A,0),12))=0, \"\", IF(ISNA(INDEX('Application V2'!A:M, MATCH(Application.!A453,'Application V2'!A:A,0),12)), \"\", INDEX('Application V2'!A:M, MATCH(Application.!A453,'Application V2'!A:A,0),12)))","v":""},null,null,null,null,null,null,null,"dataApiLuminaireEnergyUsage"]
[419,454,null,"i","   "," e",null,"Light level","dataApiLuminaireLightLevel","boolean",null,null,null,null,false,{"$f":"IF(O454=TRUE,\"Yes\", \"No\")","v":"No"},{"$f":"IF(IF(ISNA(INDEX('Application V2'!A:M, MATCH(Application.!A454,'Application V2'!A:A,0),12)), \"\", INDEX('Application V2'!A:M, MATCH(Application.!A454,'Application V2'!A:A,0),12))=0, \"\", IF(ISNA(INDEX('Application V2'!A:M, MATCH(Application.!A454,'Application V2'!A:A,0),12)), \"\", INDEX('Application V2'!A:M, MATCH(Application.!A454,'Application V2'!A:A,0),12)))","v":""},null,null,null,null,null,null,null,"dataApiLuminaireLightLevel"]
[420,455,null,"i","   "," e",null,"Occupancy status","dataApiLuminaireStatusOcc","boolean",null,null,null,null,false,{"$f":"IF(O455=TRUE,\"Yes\", \"No\")","v":"No"},{"$f":"IF(IF(ISNA(INDEX('Application V2'!A:M, MATCH(Application.!A455,'Application V2'!A:A,0),12)), \"\", INDEX('Application V2'!A:M, MATCH(Application.!A455,'Application V2'!A:A,0),12))=0, \"\", IF(ISNA(INDEX('Application V2'!A:M, MATCH(Application.!A455,'Application V2'!A:A,0),12)), \"\", INDEX('Application V2'!A:M, MATCH(Application.!A455,'Application V2'!A:A,0),12)))","v":""},null,null,null,null,null,null,null,"dataApiLuminaireStatusOcc"]
[421,456,null,"i","   "," e",null,"Luminaire/power pack status","dataApiLuminaireStatus","boolean",null,null,null,null,false,{"$f":"IF(O456=TRUE,\"Yes\", \"No\")","v":"No"},{"$f":"IF(IF(ISNA(INDEX('Application V2'!A:M, MATCH(Application.!A456,'Application V2'!A:A,0),12)), \"\", INDEX('Application V2'!A:M, MATCH(Application.!A456,'Application V2'!A:A,0),12))=0, \"\", IF(ISNA(INDEX('Application V2'!A:M, MATCH(Application.!A456,'Application V2'!A:A,0),12)), \"\", INDEX('Application V2'!A:M, MATCH(Application.!A456,'Application V2'!A:A,0),12)))","v":""},null,null,null,null,null,null,null,"dataApiLuminaireStatus"]
[422,457,null,"i","   "," e",null,"Other (explain)","dataApiLuminaireOther","text",null,null,null,null,null,{"$f":"IF(ISBLANK(M457),\"\",M457)","v":""},{"$f":"IF(IF(ISNA(INDEX('Application V2'!A:M, MATCH(Application.!A457,'Application V2'!A:A,0),12)), \"\", INDEX('Application V2'!A:M, MATCH(Application.!A457,'Application V2'!A:A,0),12))=0, \"\", IF(ISNA(INDEX('Application V2'!A:M, MATCH(Application.!A457,'Application V2'!A:A,0),12)), \"\", INDEX('Application V2'!A:M, MATCH(Application.!A457,'Application V2'!A:A,0),12)))","v":""},null,null,null,null,null,null,null,"dataApiLuminaireOther"]
[423,458,"  ","i ","   "," e","Does the API accept input of operational commands?",null,"apiInputCommands","boolean",null,null,null,null,false,{"$f":"IF(O458=TRUE,\"Yes\", \"No\")","v":"No"},{"$f":"IF(IF(ISNA(INDEX('Application V2'!A:M, MATCH(Application.!A458,'Application V2'!A:A,0),12)), \"\", INDEX('Application V2'!A:M, MATCH(Application.!A458,'Application V2'!A:A,0),12))=0, \"\", IF(ISNA(INDEX('Application V2'!A:M, MATCH(Application.!A458,'Application V2'!A:A,0),12)), \"\", INDEX('Application V2'!A:M, MATCH(Application.!A458,'Application V2'!A:A,0),12)))","v":""},null,null,null,null,null,null,null,"apiInputCommands"]
[424,459,null,"i ","   "," e","Tier 1) Does the API meet all 4 (A,B,C,D) of following Tier 1 requirements?",null,"apiTier1all","boolean",null,null,null,null,false,{"$f":"IF(O459=TRUE,\"Yes\", \"No\")","v":"No"},null,null,null,null,null,null,null,null,"apiTier1all"]
[425,460,null,"i ","   "," e",null,"(A) Available free of charge to third parties without NDA","apiTier1noNDA","boolean",null,null,null,null,false,"No",null,null,null,null,null,null,null,null,"apiTier1noNDA"]
[426,461,null,"i ","   "," e",null,"(B) Documentation available","apiTier1Docs","boolean",null,null,null,null,false,"No",null,null,null,null,null,null,null,null,"apiTier1Docs"]
[427,462,null,"i ","   "," e",null,"(C) Developer toolkit available","apiTier1Toolkit","boolean",null,null,null,null,false,"No",null,null,null,null,null,null,null,null,"apiTier1Toolkit"]
[428,463,null,"i ","   "," e",null,"(D) Support available","apiTier1Support","boolean",null,null,null,null,false,"No",null,null,null,null,null,null,null,null,"apiTier1Support"]
[429,464,null,"i ","   "," e","Tier 2) Is the API freely available to third parties without NDA?",null,"apiTier2","boolean",null,null,null,null,false,{"$f":"IF(O464=TRUE,\"Yes\", \"No\")","v":"No"},null,null,null,null,null,null,null,null,"apiTier2"]
[430,465,null,"i ","   "," e","Tier 3) Is the API open to selected partners?",null,"apiTier3","boolean",null,null,null,null,false,"No",null,null,null,null,null,null,null,null,"apiTier3"]
[431,466,null,"i ","   "," e","Tier 4) Is the API a closed proprietary system?",null,"apiTier4","boolean",null,null,null,null,false,"No",null,null,null,null,null,null,null,null,"apiTier4"]
[432,467,null,"i","   "," e\n.","Of the 4 DLC API tiers 1-4 described above, what is the lowest numbered (most open) tier that the API meets?  (Choose from dropdown menu)",null,"apiTier","text",null,null,null,null,null,{"$f":"IF(ISBLANK(M467),\"\",M467)","v":""},null,null,null,null,null,null,null,null,"apiTier"]
[433,468,"  ","i ","   "," e","Does the API follow any industry common tools for formatting?",null,"apiStandardConcat","concat 469:474",null,null,"Select all that apply",null,null,null,{"$f":"IF(IF(ISNA(INDEX('Application V2'!A:M, MATCH(Application.!A468,'Application V2'!A:A,0),12)), \"\", INDEX('Application V2'!A:M, MATCH(Application.!A468,'Application V2'!A:A,0),12))=0, \"\", IF(ISNA(INDEX('Application V2'!A:M, MATCH(Application.!A468,'Application V2'!A:A,0),12)), \"\", INDEX('Application V2'!A:M, MATCH(Application.!A468,'Application V2'!A:A,0),12)))","v":""},null,null,null,null,null,null,null,"apiStandardConcat"]
[434,469,"  ","i ","   "," e",null,"Java","apiStandardJava","boolean",null,null,null,null,false,{"$f":"IF(O469=TRUE,\"Yes\", \"No\")","v":"No"},{"$f":"IF(IF(ISNA(INDEX('Application V2'!A:M, MATCH(Application.!A469,'Application V2'!A:A,0),12)), \"\", INDEX('Application V2'!A:M, MATCH(Application.!A469,'Application V2'!A:A,0),12))=0, \"\", IF(ISNA(INDEX('Application V2'!A:M, MATCH(Application.!A469,'Application V2'!A:A,0),12)), \"\", INDEX('Application V2'!A:M, MATCH(Application.!A469,'Application V2'!A:A,0),12)))","v":""},null,null,null,null,null,null,null,"apiStandardJava"]
[435,470,null,"i ","   "," e",null,"JSON","apiStandardJson","boolean",null,null,null,null,false,{"$f":"IF(O470=TRUE,\"Yes\", \"No\")","v":"No"},{"$f":"IF(IF(ISNA(INDEX('Application V2'!A:M, MATCH(Application.!A470,'Application V2'!A:A,0),12)), \"\", INDEX('Application V2'!A:M, MATCH(Application.!A470,'Application V2'!A:A,0),12))=0, \"\", IF(ISNA(INDEX('Application V2'!A:M, MATCH(Application.!A470,'Application V2'!A:A,0),12)), \"\", INDEX('Application V2'!A:M, MATCH(Application.!A470,'Application V2'!A:A,0),12)))","v":""},null,null,null,null,null,null,null,"apiStandardJson"]
[436,471,"  ","i ","   "," e",null,"OpenAPI","apiStandardOpen","boolean",null,null,null,null,false,{"$f":"IF(O471=TRUE,\"Yes\", \"No\")","v":"No"},{"$f":"IF(IF(ISNA(INDEX('Application V2'!A:M, MATCH(Application.!A471,'Application V2'!A:A,0),12)), \"\", INDEX('Application V2'!A:M, MATCH(Application.!A471,'Application V2'!A:A,0),12))=0, \"\", IF(ISNA(INDEX('Application V2'!A:M, MATCH(Application.!A471,'Application V2'!A:A,0),12)), \"\", INDEX('Application V2'!A:M, MATCH(Application.!A471,'Application V2'!A:A,0),12)))","v":""},null,null,null,null,null,null,null,"apiStandardOpen"]
[437,472,null,"i ","   "," e",null,"REST","apiStandardRest","boolean",null,null,null,null,false,{"$f":"IF(O472=TRUE,\"Yes\", \"No\")","v":"No"},{"$f":"IF(IF(ISNA(INDEX('Application V2'!A:M, MATCH(Application.!A472,'Application V2'!A:A,0),12)), \"\", INDEX('Application V2'!A:M, MATCH(Application.!A472,'Application V2'!A:A,0),12))=0, \"\", IF(ISNA(INDEX('Application V2'!A:M, MATCH(Application.!A472,'Application V2'!A:A,0),12)), \"\", INDEX('Application V2'!A:M, MATCH(Application.!A472,'Application V2'!A:A,0),12)))","v":""},null,null,null,null,null,null,null,"apiStandardRest"]
[438,473,null,"i ","   "," e",null,"XML","apiStandardXml","boolean",null,null,null,null,false,{"$f":"IF(O473=TRUE,\"Yes\", \"No\")","v":"No"},{"$f":"IF(IF(ISNA(INDEX('Application V2'!A:M, MATCH(Application.!A473,'Application V2'!A:A,0),12)), \"\", INDEX('Application V2'!A:M, MATCH(Application.!A473,'Application V2'!A:A,0),12))=0, \"\", IF(ISNA(INDEX('Application V2'!A:M, MATCH(Application.!A473,'Application V2'!A:A,0),12)), \"\", INDEX('Application V2'!A:M, MATCH(Application.!A473,'Application V2'!A:A,0),12)))","v":""},null,null,null,null,null,null,null,"apiStandardXml"]
[439,474,"  ","i ","   "," e",null,"Other (explain)","apiStandardOther","text",null,null,null,null,null,{"$f":"IF(ISBLANK(M474),\"\",M474)","v":""},{"$f":"IF(IF(ISNA(INDEX('Application V2'!A:M, MATCH(Application.!A474,'Application V2'!A:A,0),12)), \"\", INDEX('Application V2'!A:M, MATCH(Application.!A474,'Application V2'!A:A,0),12))=0, \"\", IF(ISNA(INDEX('Application V2'!A:M, MATCH(Application.!A474,'Application V2'!A:A,0),12)), \"\", INDEX('Application V2'!A:M, MATCH(Application.!A474,'Application V2'!A:A,0),12)))","v":""},null,null,null,null,null,null,null,"apiStandardOther"]
[440,475,"  ","i ","   "," e","18)","External Systems Integration (e.g. BMS, EMS, HVAC, Lighting, API, Cloud)","blank",null,null,null,null,null,null,null,{"$f":"IF(IF(ISNA(INDEX('Application V2'!A:M, MATCH(Application.!A475,'Application V2'!A:A,0),12)), \"\", INDEX('Application V2'!A:M, MATCH(Application.!A475,'Application V2'!A:A,0),12))=0, \"\", IF(ISNA(INDEX('Application V2'!A:M, MATCH(Application.!A475,'Application V2'!A:A,0),12)), \"\", INDEX('Application V2'!A:M, MATCH(Application.!A475,'Application V2'!A:A,0),12)))","v":""},null,null,null,null,null,null,null,"blank"]
[441,476,"  ","i ","   "," e","19) ","Emergency Lighting","blank",null,null,null,null,null,null,null,{"$f":"IF(IF(ISNA(INDEX('Application V2'!A:M, MATCH(Application.!A476,'Application V2'!A:A,0),12)), \"\", INDEX('Application V2'!A:M, MATCH(Application.!A476,'Application V2'!A:A,0),12))=0, \"\", IF(ISNA(INDEX('Application V2'!A:M, MATCH(Application.!A476,'Application V2'!A:A,0),12)), \"\", INDEX('Application V2'!A:M, MATCH(Application.!A476,'Application V2'!A:A,0),12)))","v":""},null,null,null,null,null,null,null,"blank"]
[442,477," \n\n \n \n\n \n \n\n\n \n"," \n\n \n \n\n \n \n\n\n \n"," \n\n \n \n\n \n \n\n\n \n"," .\n \n \n \n \n \n \n \n \n \n \n\n \n \n \n ","Publicly available documentation illustrating how a system’s luminaires connect with an emergency power source.\n\nThe QPL will identify online documentation provided by manufacturers for system designers to refer to.  This documentation will identify wiring diagrams, required components, and/or application guides needed to understand design considerations for integrating the system into an emergency lighting system. ",null,"blank",null,null,null,null,null,null,null,{"$f":"IF(IF(ISNA(INDEX('Application V2'!A:M, MATCH(Application.!A477,'Application V2'!A:A,0),12)), \"\", INDEX('Application V2'!A:M, MATCH(Application.!A477,'Application V2'!A:A,0),12))=0, \"\", IF(ISNA(INDEX('Application V2'!A:M, MATCH(Application.!A477,'Application V2'!A:A,0),12)), \"\", INDEX('Application V2'!A:M, MATCH(Application.!A477,'Application V2'!A:A,0),12)))","v":""},null,null,null,null,null,null,null,"blank"]
[443,478,"  ","i ","   "," e","Are online instructions (such as a wiring diagram) available for how to configure the system to interact with one or more of the following emergency power sources?  If so, enter URL weblink below.",null,"hasEmergencyDoc","boolean",null,null,null,null,false,{"$f":"IF(O478=TRUE,\"Yes\", \"No\")","v":"No"},{"$f":"IF(IF(ISNA(INDEX('Application V2'!A:M, MATCH(Application.!A478,'Application V2'!A:A,0),12)), \"\", INDEX('Application V2'!A:M, MATCH(Application.!A478,'Application V2'!A:A,0),12))=0, \"\", IF(ISNA(INDEX('Application V2'!A:M, MATCH(Application.!A478,'Application V2'!A:A,0),12)), \"\", INDEX('Application V2'!A:M, MATCH(Application.!A478,'Application V2'!A:A,0),12)))","v":""},null,null,null,null,null,null,null,"hasEmergencyDoc"]
[444,479,"  ","i ","   "," e",null,"On-luminaire battery backup, online URL?","emergencyDocBattery","text (might include URL)",null,null,null,null,null,{"$f":"IF(ISBLANK(M479),\"\",M479)","v":""},{"$f":"IF(IF(ISNA(INDEX('Application V2'!A:M, MATCH(Application.!A479,'Application V2'!A:A,0),12)), \"\", INDEX('Application V2'!A:M, MATCH(Application.!A479,'Application V2'!A:A,0),12))=0, \"\", IF(ISNA(INDEX('Application V2'!A:M, MATCH(Application.!A479,'Application V2'!A:A,0),12)), \"\", INDEX('Application V2'!A:M, MATCH(Application.!A479,'Application V2'!A:A,0),12)))","v":""},null,null,null,null,null,null,null,"emergencyDocBattery"]
[445,480,"  ","i ","   "," e\n ",null,"Remote source switched at luminaire, online URL?","emergencyDocRelayLuminaire","text (might include URL)",null,null,null,null,null,{"$f":"IF(ISBLANK(M480),\"\",M480)","v":""},{"$f":"IF(IF(ISNA(INDEX('Application V2'!A:M, MATCH(Application.!A480,'Application V2'!A:A,0),12)), \"\", INDEX('Application V2'!A:M, MATCH(Application.!A480,'Application V2'!A:A,0),12))=0, \"\", IF(ISNA(INDEX('Application V2'!A:M, MATCH(Application.!A480,'Application V2'!A:A,0),12)), \"\", INDEX('Application V2'!A:M, MATCH(Application.!A480,'Application V2'!A:A,0),12)))","v":""},null,null,null,null,null,null,null,"emergencyDocRelayLuminaire"]
[446,481,"  ","\n i ","   "," e",null,"Remote source switched at central location, online URL","emergencyDocRelayCircuit","text (might include URL)",null,null,null,null,null,{"$f":"IF(ISBLANK(M481),\"\",M481)","v":""},{"$f":"IF(IF(ISNA(INDEX('Application V2'!A:M, MATCH(Application.!A481,'Application V2'!A:A,0),12)), \"\", INDEX('Application V2'!A:M, MATCH(Application.!A481,'Application V2'!A:A,0),12))=0, \"\", IF(ISNA(INDEX('Application V2'!A:M, MATCH(Application.!A481,'Application V2'!A:A,0),12)), \"\", INDEX('Application V2'!A:M, MATCH(Application.!A481,'Application V2'!A:A,0),12)))","v":""},null,null,null,null,null,null,null,"emergencyDocRelayCircuit"]
[447,482,"  ","\n i ","   "," e","Can the system perform Life-SafetyCompliance testing, and generate summary reports to support life-safety compliance?",null,"emergencyDocSafetyReport","boolean",null,null,null,null,false,{"$f":"IF(O482=TRUE,\"Yes\", \"No\")","v":"No"},{"$f":"IF(IF(ISNA(INDEX('Application V2'!A:M, MATCH(Application.!A482,'Application V2'!A:A,0),12)), \"\", INDEX('Application V2'!A:M, MATCH(Application.!A482,'Application V2'!A:A,0),12))=0, \"\", IF(ISNA(INDEX('Application V2'!A:M, MATCH(Application.!A482,'Application V2'!A:A,0),12)), \"\", INDEX('Application V2'!A:M, MATCH(Application.!A482,'Application V2'!A:A,0),12)))","v":""},null,null,null,null,null,null,null,"emergencyDocSafetyReport"]
[448,483,"  ","i ","   "," e","19) ","Emergency Lighting","blank",null,null,null,null,null,null,null,{"$f":"IF(IF(ISNA(INDEX('Application V2'!A:M, MATCH(Application.!A483,'Application V2'!A:A,0),12)), \"\", INDEX('Application V2'!A:M, MATCH(Application.!A483,'Application V2'!A:A,0),12))=0, \"\", IF(ISNA(INDEX('Application V2'!A:M, MATCH(Application.!A483,'Application V2'!A:A,0),12)), \"\", INDEX('Application V2'!A:M, MATCH(Application.!A483,'Application V2'!A:A,0),12)))","v":""},null,null,null,null,null,null,null,"blank"]
[449,484,"I ","  ","E",null,"20)","Cybersecurity","blank",null,null,null,null,null,null,null,{"$f":"IF(IF(ISNA(INDEX('Application V2'!A:M, MATCH(Application.!A484,'Application V2'!A:A,0),12)), \"\", INDEX('Application V2'!A:M, MATCH(Application.!A484,'Application V2'!A:A,0),12))=0, \"\", IF(ISNA(INDEX('Application V2'!A:M, MATCH(Application.!A484,'Application V2'!A:A,0),12)), \"\", INDEX('Application V2'!A:M, MATCH(Application.!A484,'Application V2'!A:A,0),12)))","v":""},null,null,null,null,null,null,null,"blank"]
[450,485,"\n\n \n\n\n\n\n\n\n\n\n\n\n\n\n\n",null,"   ",null,"Definition: A  cybersecurity certification that meets the DLC criteria.  The current standards are shown in Table CS-1 and listed here:\n•\tANSI/UL 2900-1 \n•\tIEC 62443 \n•\tSOC 2 \n•\tISO 27001 \n•\tISO 27017 (with 27001) \n•\tFedRAMP \n•\tCSA STAR\n•\tioXt\nThe current services are shown in Table CS-2 and listed here:\n•\tUL IoT Security Rating (UL 1376)\n•\tCSA Cybersecurity Verification Program (CVP) (CSA T200)\n•\tIntertek Cyber Assured \nDocumentation requirements to demonstrate certification are shown in Tables CS-2 and CS-3 of the NLC5 Technical Requirements.",null,null,null,null,null,null,null,null,null,{"$f":"IF(IF(ISNA(INDEX('Application V2'!A:M, MATCH(Application.!A485,'Application V2'!A:A,0),12)), \"\", INDEX('Application V2'!A:M, MATCH(Application.!A485,'Application V2'!A:A,0),12))=0, \"\", IF(ISNA(INDEX('Application V2'!A:M, MATCH(Application.!A485,'Application V2'!A:A,0),12)), \"\", INDEX('Application V2'!A:M, MATCH(Application.!A485,'Application V2'!A:A,0),12)))","v":""}]
[451,486,"I ","  ","E",null,"Are one or more of the following cybersecurity standards met?",null,"hasCyber","boolean",null,null,null,null,false,{"$f":"IF(O486=TRUE,\"Yes\", \"No\")","v":"No"},null,null,null,null,null,null,null,null,"hasCyber"]
[452,487,"I ","  ","E",null,"Which cybersecurity standard(s) are met?",null,"cyberConcat","concat 488:496",null,null,null,null,null,null,null,null,null,null,null,null,null,null,"cyberConcat"]
[453,488,null,"i ","   "," e",null,"ANSI UL 2900-1","cyberUL2901","boolean",null,null,null,null,false,{"$f":"IF(O488=TRUE,\"Yes\", \"No\")","v":"No"},{"$f":"IF(IF(ISNA(INDEX('Application V2'!A:M, MATCH(Application.!A488,'Application V2'!A:A,0),12)), \"\", INDEX('Application V2'!A:M, MATCH(Application.!A488,'Application V2'!A:A,0),12))=0, \"\", IF(ISNA(INDEX('Application V2'!A:M, MATCH(Application.!A488,'Application V2'!A:A,0),12)), \"\", INDEX('Application V2'!A:M, MATCH(Application.!A488,'Application V2'!A:A,0),12)))","v":""},null,null,null,null,null,null,null,"cyberUL2901"]
[454,489,null,"i ","   "," e",null,"IEC 62443","cyberIec62443","boolean",null,null,null,null,false,{"$f":"IF(O489=TRUE,\"Yes\", \"No\")","v":"No"},{"$f":"IF(IF(ISNA(INDEX('Application V2'!A:M, MATCH(Application.!A489,'Application V2'!A:A,0),12)), \"\", INDEX('Application V2'!A:M, MATCH(Application.!A489,'Application V2'!A:A,0),12))=0, \"\", IF(ISNA(INDEX('Application V2'!A:M, MATCH(Application.!A489,'Application V2'!A:A,0),12)), \"\", INDEX('Application V2'!A:M, MATCH(Application.!A489,'Application V2'!A:A,0),12)))","v":""},null,null,null,null,null,null,null,"cyberIec62443"]
[455,490,null,"i ","   "," e",null,"If so, which document (e.g. \"-4-1\")","cyberIec62443text","text",null,null,null,null,null,{"$f":"IF(ISBLANK(M490),\"\",M490)","v":""},{"$f":"IF(IF(ISNA(INDEX('Application V2'!A:M, MATCH(Application.!A490,'Application V2'!A:A,0),12)), \"\", INDEX('Application V2'!A:M, MATCH(Application.!A490,'Application V2'!A:A,0),12))=0, \"\", IF(ISNA(INDEX('Application V2'!A:M, MATCH(Application.!A490,'Application V2'!A:A,0),12)), \"\", INDEX('Application V2'!A:M, MATCH(Application.!A490,'Application V2'!A:A,0),12)))","v":""},null,null,null,null,null,null,null,"cyberIec62443text"]
[456,491,null,"i ","   "," e",null,"SOC2","cyberSoc2","boolean",null,null,null,null,false,{"$f":"IF(O491=TRUE,\"Yes\", \"No\")","v":"No"},{"$f":"IF(IF(ISNA(INDEX('Application V2'!A:M, MATCH(Application.!A491,'Application V2'!A:A,0),12)), \"\", INDEX('Application V2'!A:M, MATCH(Application.!A491,'Application V2'!A:A,0),12))=0, \"\", IF(ISNA(INDEX('Application V2'!A:M, MATCH(Application.!A491,'Application V2'!A:A,0),12)), \"\", INDEX('Application V2'!A:M, MATCH(Application.!A491,'Application V2'!A:A,0),12)))","v":""},null,null,null,null,null,null,null,"cyberSoc2"]
[458,492,null,"i ","   "," e",null,"ISO 27,001","cyberIso27001","boolean",null,null,null,null,false,{"$f":"IF(O492=TRUE,\"Yes\", \"No\")","v":"No"},{"$f":"IF(IF(ISNA(INDEX('Application V2'!A:M, MATCH(Application.!A492,'Application V2'!A:A,0),12)), \"\", INDEX('Application V2'!A:M, MATCH(Application.!A492,'Application V2'!A:A,0),12))=0, \"\", IF(ISNA(INDEX('Application V2'!A:M, MATCH(Application.!A492,'Application V2'!A:A,0),12)), \"\", INDEX('Application V2'!A:M, MATCH(Application.!A492,'Application V2'!A:A,0),12)))","v":""},null,null,null,null,null,null,null,"cyberIso27001"]
[459,493,null,"i ","   "," e",null,"ISO 27,017","cyberIso27017","boolean",null,null,null,null,false,"No",null,null,null,null,null,null,null,null,"cyberIso27017"]
[460,494,null,"i ","   "," e",null,"FedRAMP","cyberFedRamp","boolean",null,null,null,null,false,"No",null,null,null,null,null,null,null,null,"cyberFedRamp"]
[461,495,null,"i ","   "," e",null,"CSA STAR","CyberCsaStar","boolean",null,null,null,null,false,"No",null,null,null,null,null,null,null,null,"CyberCsaStar"]
[461.1,496,null,"i",null,"e",null,"ioXt","cyberioXt","boolean",null,null,null,null,false,"No"]
[461.2,497,null,"i",null,"e","Which cybersecurity services are met?",null,"cyberservicesConcat","concat 498:500"]
[461.3,498,null,"i",null,"e",null,"UL MCV 1376","cyberUL1376","boolean",null,null,null,null,false,"No"]
[461.4,499,null,"i",null,"e",null,"CSA T200","cyberCsaT200","boolean",null,null,null,null,false,"No"]
[461.5,500,null,"i",null,"e",null,"Intertek Cyber Assured","cyberIntertek","boolean",null,null,null,null,false,"No"]
[462,501,null,"i ","   "," e","Does the system comply with CA SB-327?",null,"cyberSB327","boolean",null,null,null,null,false,"No",{"$f":"IF(IF(ISNA(INDEX('Application V2'!A:M, MATCH(Application.!A501,'Application V2'!A:A,0),12)), \"\", INDEX('Application V2'!A:M, MATCH(Application.!A501,'Application V2'!A:A,0),12))=0, \"\", IF(ISNA(INDEX('Application V2'!A:M, MATCH(Application.!A501,'Application V2'!A:A,0),12)), \"\", INDEX('Application V2'!A:M, MATCH(Application.!A501,'Application V2'!A:A,0),12)))","v":""},null,null,null,null,null,null,null,"cyberSB327"]
[463,502,"  ","i ","   "," e","20)","Cyber Security","blank",null,null,null,null,null,null,null,{"$f":"IF(IF(ISNA(INDEX('Application V2'!A:M, MATCH(Application.!A502,'Application V2'!A:A,0),12)), \"\", INDEX('Application V2'!A:M, MATCH(Application.!A502,'Application V2'!A:A,0),12))=0, \"\", IF(ISNA(INDEX('Application V2'!A:M, MATCH(Application.!A502,'Application V2'!A:A,0),12)), \"\", INDEX('Application V2'!A:M, MATCH(Application.!A502,'Application V2'!A:A,0),12)))","v":""},null,null,null,null,null,null,null,"blank"]
[464,503,"  ","i ","   "," e","21)","Color Changing / Tuning","blank",null,null,null,null,null,null,null,{"$f":"IF(IF(ISNA(INDEX('Application V2'!A:M, MATCH(Application.!A503,'Application V2'!A:A,0),12)), \"\", INDEX('Application V2'!A:M, MATCH(Application.!A503,'Application V2'!A:A,0),12))=0, \"\", IF(ISNA(INDEX('Application V2'!A:M, MATCH(Application.!A503,'Application V2'!A:A,0),12)), \"\", INDEX('Application V2'!A:M, MATCH(Application.!A503,'Application V2'!A:A,0),12)))","v":""},null,null,null,null,null,null,null,"blank"]
[465,504,"\n \n \n \n \n \n \n \n ","\n \n \n \n \n \n \n \n ","\n \n \n \n \n \n \n \n ","\n \n \n \n \n \n \n \n ","The capability to alter the output and color of tunable white and/or variable color output luminaires via a dedicated control interface(s). To demonstrate compliance with this capability, the interface(s) must be clearly described in the product literature and allow for at least two CCT settings.  These settings may be described in terms of CCT, such as 3000K or 5000K, or simple descriptive terms for the desired setting such as 'Night' or 'Day', for example. The product literature must also specify installation and configuration requirements to implement this functionality. ",null,"blank",null,null,null,null,null,null,null,{"$f":"IF(IF(ISNA(INDEX('Application V2'!A:M, MATCH(Application.!A504,'Application V2'!A:A,0),12)), \"\", INDEX('Application V2'!A:M, MATCH(Application.!A504,'Application V2'!A:A,0),12))=0, \"\", IF(ISNA(INDEX('Application V2'!A:M, MATCH(Application.!A504,'Application V2'!A:A,0),12)), \"\", INDEX('Application V2'!A:M, MATCH(Application.!A504,'Application V2'!A:A,0),12)))","v":""},null,null,null,null,null,null,null,"blank"]
[466,505,null,"i "," "," e","Does the system support Color Changing/Tuning as defined above, with instructions for how to configure and/or use this feature??",null,"hasColor","boolean",null,null,null,null,false,{"$f":"IF(O505=TRUE,\"Yes\", \"No\")","v":"No"},{"$f":"IF(IF(ISNA(INDEX('Application V2'!A:M, MATCH(Application.!A505,'Application V2'!A:A,0),12)), \"\", INDEX('Application V2'!A:M, MATCH(Application.!A505,'Application V2'!A:A,0),12))=0, \"\", IF(ISNA(INDEX('Application V2'!A:M, MATCH(Application.!A505,'Application V2'!A:A,0),12)), \"\", INDEX('Application V2'!A:M, MATCH(Application.!A505,'Application V2'!A:A,0),12)))","v":""},null,null,null,null,null,null,null,"hasColor"]
[467,506,"  ","i ","   "," e","If yes, what control is offered?",null,"colorConcat","concat 507:511",null,null,"Select all that apply",null,null,null,{"$f":"IF(IF(ISNA(INDEX('Application V2'!A:M, MATCH(Application.!A506,'Application V2'!A:A,0),12)), \"\", INDEX('Application V2'!A:M, MATCH(Application.!A506,'Application V2'!A:A,0),12))=0, \"\", IF(ISNA(INDEX('Application V2'!A:M, MATCH(Application.!A506,'Application V2'!A:A,0),12)), \"\", INDEX('Application V2'!A:M, MATCH(Application.!A506,'Application V2'!A:A,0),12)))","v":""},null,null,null,null,null,null,null,"colorConcat"]
[468,507,null,"i ","   "," e",null,"Select CCT","colorSelectCCT","boolean",null,null,null,null,false,{"$f":"IF(O507=TRUE,\"Yes\", \"No\")","v":"No"},{"$f":"IF(IF(ISNA(INDEX('Application V2'!A:M, MATCH(Application.!A507,'Application V2'!A:A,0),12)), \"\", INDEX('Application V2'!A:M, MATCH(Application.!A507,'Application V2'!A:A,0),12))=0, \"\", IF(ISNA(INDEX('Application V2'!A:M, MATCH(Application.!A507,'Application V2'!A:A,0),12)), \"\", INDEX('Application V2'!A:M, MATCH(Application.!A507,'Application V2'!A:A,0),12)))","v":""},null,null,null,null,null,null,null,"colorSelectCCT"]
[469,508,null,"i ","   "," e",null,"Select color (Hue)","colorSelectHue","boolean",null,null,null,null,false,{"$f":"IF(O508=TRUE,\"Yes\", \"No\")","v":"No"},{"$f":"IF(IF(ISNA(INDEX('Application V2'!A:M, MATCH(Application.!A508,'Application V2'!A:A,0),12)), \"\", INDEX('Application V2'!A:M, MATCH(Application.!A508,'Application V2'!A:A,0),12))=0, \"\", IF(ISNA(INDEX('Application V2'!A:M, MATCH(Application.!A508,'Application V2'!A:A,0),12)), \"\", INDEX('Application V2'!A:M, MATCH(Application.!A508,'Application V2'!A:A,0),12)))","v":""},null,null,null,null,null,null,null,"colorSelectHue"]
[470,509,"  ","i ","   "," e",null,"CCT graphic display","colorShowCCT","boolean",null,null,null,null,false,{"$f":"IF(O509=TRUE,\"Yes\", \"No\")","v":"No"},{"$f":"IF(IF(ISNA(INDEX('Application V2'!A:M, MATCH(Application.!A509,'Application V2'!A:A,0),12)), \"\", INDEX('Application V2'!A:M, MATCH(Application.!A509,'Application V2'!A:A,0),12))=0, \"\", IF(ISNA(INDEX('Application V2'!A:M, MATCH(Application.!A509,'Application V2'!A:A,0),12)), \"\", INDEX('Application V2'!A:M, MATCH(Application.!A509,'Application V2'!A:A,0),12)))","v":""},null,null,null,null,null,null,null,"colorShowCCT"]
[471,510,"  ","i ","   "," e",null,"Color graphic display","colorShowHue","boolean",null,null,null,null,false,{"$f":"IF(O510=TRUE,\"Yes\", \"No\")","v":"No"},{"$f":"IF(IF(ISNA(INDEX('Application V2'!A:M, MATCH(Application.!A510,'Application V2'!A:A,0),12)), \"\", INDEX('Application V2'!A:M, MATCH(Application.!A510,'Application V2'!A:A,0),12))=0, \"\", IF(ISNA(INDEX('Application V2'!A:M, MATCH(Application.!A510,'Application V2'!A:A,0),12)), \"\", INDEX('Application V2'!A:M, MATCH(Application.!A510,'Application V2'!A:A,0),12)))","v":""},null,null,null,null,null,null,null,"colorShowHue"]
[472,511,null,"i ","   "," e",null,"Other (explain)","colorOther","text",null,null,null,null,null,{"$f":"M511","v":0},{"$f":"IF(IF(ISNA(INDEX('Application V2'!A:M, MATCH(Application.!A511,'Application V2'!A:A,0),12)), \"\", INDEX('Application V2'!A:M, MATCH(Application.!A511,'Application V2'!A:A,0),12))=0, \"\", IF(ISNA(INDEX('Application V2'!A:M, MATCH(Application.!A511,'Application V2'!A:A,0),12)), \"\", INDEX('Application V2'!A:M, MATCH(Application.!A511,'Application V2'!A:A,0),12)))","v":""},null,null,null,null,null,null,null,"colorOther"]
[473,512,null,"i ","   "," e","How is color data communicated to each luminaire?",null,"colorDataConcat","concat 513:514",null,null,"Select all that apply",null,null,null,null,null,null,null,null,null,null,null,"colorDataConcat"]
[474,513,null,"i ","   "," e",null,"Analog","colorDataAnalog","boolean",null,null,null,null,false,{"$f":"IF(O513=TRUE,\"Yes\", \"No\")","v":"No"},null,null,null,null,null,null,null,null,"colorDataAnalog"]
[475,514,null,"i ","   "," e",null,"Digital ","colorDataDigital","boolean",null,null,null,null,false,{"$f":"IF(O514=TRUE,\"Yes\", \"No\")","v":"No"},null,null,null,null,null,null,null,null,"colorDataDigital"]
[476,515,"  ","i ","   "," e","21)","Color Changing / Tuning","blank",null,null,null,null,null,null,null,{"$f":"IF(IF(ISNA(INDEX('Application V2'!A:M, MATCH(Application.!A515,'Application V2'!A:A,0),12)), \"\", INDEX('Application V2'!A:M, MATCH(Application.!A515,'Application V2'!A:A,0),12))=0, \"\", IF(ISNA(INDEX('Application V2'!A:M, MATCH(Application.!A515,'Application V2'!A:A,0),12)), \"\", INDEX('Application V2'!A:M, MATCH(Application.!A515,'Application V2'!A:A,0),12)))","v":""},null,null,null,null,null,null,null,"blank"]
[477,516,"  ","i ","   "," e","22)","Ease of Implementation","blank",null,null,null,null,null,null,null,{"$f":"IF(IF(ISNA(INDEX('Application V2'!A:M, MATCH(Application.!A516,'Application V2'!A:A,0),12)), \"\", INDEX('Application V2'!A:M, MATCH(Application.!A516,'Application V2'!A:A,0),12))=0, \"\", IF(ISNA(INDEX('Application V2'!A:M, MATCH(Application.!A516,'Application V2'!A:A,0),12)), \"\", INDEX('Application V2'!A:M, MATCH(Application.!A516,'Application V2'!A:A,0),12)))","v":""},null,null,null,null,null,null,null,"blank"]
[478,517,"\n \n \n \n ","\n \n \n \n ","\n \n \n \n ","\n \n \n \n ","Definition:  The QPL will identify the most typical responsible party and their required level of training to start-up and configure the system to the extent that all Required Capabilities are functioning.  Documentation is not required.",null,"blank",null,null,null,null,null,null,null,{"$f":"IF(IF(ISNA(INDEX('Application V2'!A:M, MATCH(Application.!A517,'Application V2'!A:A,0),12)), \"\", INDEX('Application V2'!A:M, MATCH(Application.!A517,'Application V2'!A:A,0),12))=0, \"\", IF(ISNA(INDEX('Application V2'!A:M, MATCH(Application.!A517,'Application V2'!A:A,0),12)), \"\", INDEX('Application V2'!A:M, MATCH(Application.!A517,'Application V2'!A:A,0),12)))","v":""},null,null,null,null,null,null,null,"blank"]
[479,518,"  ","i ","   "," e","Who primarily starts up and configures the system and how much training is typically required?  Select one most typical, or describe in \"Other\".",null,"startupPartyConcat","concat 519:523",null,null,null,null,null,null,{"$f":"IF(IF(ISNA(INDEX('Application V2'!A:M, MATCH(Application.!A518,'Application V2'!A:A,0),12)), \"\", INDEX('Application V2'!A:M, MATCH(Application.!A518,'Application V2'!A:A,0),12))=0, \"\", IF(ISNA(INDEX('Application V2'!A:M, MATCH(Application.!A518,'Application V2'!A:A,0),12)), \"\", INDEX('Application V2'!A:M, MATCH(Application.!A518,'Application V2'!A:A,0),12)))","v":""},null,null,null,null,null,null,null,"startupPartyConcat"]
[480,519,"  ","i ","   "," e",null,"Installation contractor with less than 1 day of training ","startupParty1","boolean",null,null,null,null,false,{"$f":"IF(O519=TRUE,\"Yes\", \"No\")","v":"No"},{"$f":"IF(IF(ISNA(INDEX('Application V2'!A:M, MATCH(Application.!A519,'Application V2'!A:A,0),12)), \"\", INDEX('Application V2'!A:M, MATCH(Application.!A519,'Application V2'!A:A,0),12))=0, \"\", IF(ISNA(INDEX('Application V2'!A:M, MATCH(Application.!A519,'Application V2'!A:A,0),12)), \"\", INDEX('Application V2'!A:M, MATCH(Application.!A519,'Application V2'!A:A,0),12)))","v":""},null,null,null,null,null,null,null,"startupParty1"]
[481,520,"  ","i ","   "," e",null,"Installation contractor with less than 1 day of training, working with remote personnel at factory","startupParty2","boolean",null,null,null,null,false,{"$f":"IF(O520=TRUE,\"Yes\", \"No\")","v":"No"},{"$f":"IF(IF(ISNA(INDEX('Application V2'!A:M, MATCH(Application.!A520,'Application V2'!A:A,0),12)), \"\", INDEX('Application V2'!A:M, MATCH(Application.!A520,'Application V2'!A:A,0),12))=0, \"\", IF(ISNA(INDEX('Application V2'!A:M, MATCH(Application.!A520,'Application V2'!A:A,0),12)), \"\", INDEX('Application V2'!A:M, MATCH(Application.!A520,'Application V2'!A:A,0),12)))","v":""},null,null,null,null,null,null,null,"startupParty2"]
[482,521,"  ","i ","   "," e",null,"Factory-trained installation contractor with 1 day or more factory training ","startupParty3","boolean",null,null,null,null,false,{"$f":"IF(O521=TRUE,\"Yes\", \"No\")","v":"No"},{"$f":"IF(IF(ISNA(INDEX('Application V2'!A:M, MATCH(Application.!A521,'Application V2'!A:A,0),12)), \"\", INDEX('Application V2'!A:M, MATCH(Application.!A521,'Application V2'!A:A,0),12))=0, \"\", IF(ISNA(INDEX('Application V2'!A:M, MATCH(Application.!A521,'Application V2'!A:A,0),12)), \"\", INDEX('Application V2'!A:M, MATCH(Application.!A521,'Application V2'!A:A,0),12)))","v":""},null,null,null,null,null,null,null,"startupParty3"]
[483,522,"  ","i ","   "," e",null,"Factory representative on-site ","startupParty4","boolean",null,null,null,null,false,{"$f":"IF(O522=TRUE,\"Yes\", \"No\")","v":"No"},{"$f":"IF(IF(ISNA(INDEX('Application V2'!A:M, MATCH(Application.!A522,'Application V2'!A:A,0),12)), \"\", INDEX('Application V2'!A:M, MATCH(Application.!A522,'Application V2'!A:A,0),12))=0, \"\", IF(ISNA(INDEX('Application V2'!A:M, MATCH(Application.!A522,'Application V2'!A:A,0),12)), \"\", INDEX('Application V2'!A:M, MATCH(Application.!A522,'Application V2'!A:A,0),12)))","v":""},null,null,null,null,null,null,null,"startupParty4"]
[484,523,"  ","i ","   "," e",null,"Other (describe)","startupParty5","text",null,null,null,null,null,{"$f":"M523","v":0},{"$f":"IF(IF(ISNA(INDEX('Application V2'!A:M, MATCH(Application.!A523,'Application V2'!A:A,0),12)), \"\", INDEX('Application V2'!A:M, MATCH(Application.!A523,'Application V2'!A:A,0),12))=0, \"\", IF(ISNA(INDEX('Application V2'!A:M, MATCH(Application.!A523,'Application V2'!A:A,0),12)), \"\", INDEX('Application V2'!A:M, MATCH(Application.!A523,'Application V2'!A:A,0),12)))","v":""},null,null,null,null,null,null,null,"startupParty5"]
[485,524,"  ","i ","   "," e","22)","Ease of Implementation","blank",null,null,null,null,null,null,null,{"$f":"IF(IF(ISNA(INDEX('Application V2'!A:M, MATCH(Application.!A524,'Application V2'!A:A,0),12)), \"\", INDEX('Application V2'!A:M, MATCH(Application.!A524,'Application V2'!A:A,0),12))=0, \"\", IF(ISNA(INDEX('Application V2'!A:M, MATCH(Application.!A524,'Application V2'!A:A,0),12)), \"\", INDEX('Application V2'!A:M, MATCH(Application.!A524,'Application V2'!A:A,0),12)))","v":""},null,null,null,null,null,null,null,"blank"]
[486,525,"  ","i ","   "," e","23)","Scenes","blank",null,null,null,null,null,null,null,{"$f":"IF(IF(ISNA(INDEX('Application V2'!A:M, MATCH(Application.!A525,'Application V2'!A:A,0),12)), \"\", INDEX('Application V2'!A:M, MATCH(Application.!A525,'Application V2'!A:A,0),12))=0, \"\", IF(ISNA(INDEX('Application V2'!A:M, MATCH(Application.!A525,'Application V2'!A:A,0),12)), \"\", INDEX('Application V2'!A:M, MATCH(Application.!A525,'Application V2'!A:A,0),12)))","v":""},null,null,null,null,null,null,null,"blank"]
[487,526,"\n \n \n \n ","\n \n \n \n ","\n \n \n \n ","\n \n \n \n ","Definition:  The capability of a system to provide two or more pre-programmed light level settings for a group or multiple groups of luminaires to suit multiple activities in a space, and allow for recall of these settings via a switch, control device, or signal from a BMS or API. ",null,"blank",null,null,null,null,null,null,null,{"$f":"IF(IF(ISNA(INDEX('Application V2'!A:M, MATCH(Application.!A526,'Application V2'!A:A,0),12)), \"\", INDEX('Application V2'!A:M, MATCH(Application.!A526,'Application V2'!A:A,0),12))=0, \"\", IF(ISNA(INDEX('Application V2'!A:M, MATCH(Application.!A526,'Application V2'!A:A,0),12)), \"\", INDEX('Application V2'!A:M, MATCH(Application.!A526,'Application V2'!A:A,0),12)))","v":""},null,null,null,null,null,null,null,"blank"]
[488,527,"  ","i ","   "," e","Does the system support scenes, with instructions for how to configure and/or use this feature?",null,"blank",null,null,null,null,null,null,null,{"$f":"IF(IF(ISNA(INDEX('Application V2'!A:M, MATCH(Application.!A527,'Application V2'!A:A,0),12)), \"\", INDEX('Application V2'!A:M, MATCH(Application.!A527,'Application V2'!A:A,0),12))=0, \"\", IF(ISNA(INDEX('Application V2'!A:M, MATCH(Application.!A527,'Application V2'!A:A,0),12)), \"\", INDEX('Application V2'!A:M, MATCH(Application.!A527,'Application V2'!A:A,0),12)))","v":""},null,null,null,null,null,null,null,"blank"]
[489,528,null,"i ","   "," e","How are scenes programmed?",null,"sceneProgramConcat","concat 529:531",null,null,"Select all that apply",null,null,null,{"$f":"IF(IF(ISNA(INDEX('Application V2'!A:M, MATCH(Application.!A528,'Application V2'!A:A,0),12)), \"\", INDEX('Application V2'!A:M, MATCH(Application.!A528,'Application V2'!A:A,0),12))=0, \"\", IF(ISNA(INDEX('Application V2'!A:M, MATCH(Application.!A528,'Application V2'!A:A,0),12)), \"\", INDEX('Application V2'!A:M, MATCH(Application.!A528,'Application V2'!A:A,0),12)))","v":""},null,null,null,null,null,null,null,"sceneProgramConcat"]
[490,529,null,"i ","   "," e",null,"Manual switch","sceneProgramSwitch","boolean",null,null,null,null,false,{"$f":"IF(O529=TRUE,\"Yes\", \"No\")","v":"No"},{"$f":"IF(IF(ISNA(INDEX('Application V2'!A:M, MATCH(Application.!A529,'Application V2'!A:A,0),12)), \"\", INDEX('Application V2'!A:M, MATCH(Application.!A529,'Application V2'!A:A,0),12))=0, \"\", IF(ISNA(INDEX('Application V2'!A:M, MATCH(Application.!A529,'Application V2'!A:A,0),12)), \"\", INDEX('Application V2'!A:M, MATCH(Application.!A529,'Application V2'!A:A,0),12)))","v":""},null,null,null,null,null,null,null,"sceneProgramSwitch"]
[491,530,null,"i ","   "," e",null,"Graphical User Interface","sceneProgramGui","boolean",null,null,null,null,false,{"$f":"IF(O530=TRUE,\"Yes\", \"No\")","v":"No"},{"$f":"IF(IF(ISNA(INDEX('Application V2'!A:M, MATCH(Application.!A530,'Application V2'!A:A,0),12)), \"\", INDEX('Application V2'!A:M, MATCH(Application.!A530,'Application V2'!A:A,0),12))=0, \"\", IF(ISNA(INDEX('Application V2'!A:M, MATCH(Application.!A530,'Application V2'!A:A,0),12)), \"\", INDEX('Application V2'!A:M, MATCH(Application.!A530,'Application V2'!A:A,0),12)))","v":""},null,null,null,null,null,null,null,"sceneProgramGui"]
[492,531,null,"i ","   "," e",null,"Other (explain)","sceneProgramOther","text",null,null,null,null,null,null,{"$f":"IF(IF(ISNA(INDEX('Application V2'!A:M, MATCH(Application.!A531,'Application V2'!A:A,0),12)), \"\", INDEX('Application V2'!A:M, MATCH(Application.!A531,'Application V2'!A:A,0),12))=0, \"\", IF(ISNA(INDEX('Application V2'!A:M, MATCH(Application.!A531,'Application V2'!A:A,0),12)), \"\", INDEX('Application V2'!A:M, MATCH(Application.!A531,'Application V2'!A:A,0),12)))","v":""},null,null,null,null,null,null,null,"sceneProgramOther"]
[493,532,null,"i ","   "," e","How are scenes selected?",null,"sceneSelectConcat","concat 533:537",null,null,"Select all that apply",null,null,null,{"$f":"IF(IF(ISNA(INDEX('Application V2'!A:M, MATCH(Application.!A532,'Application V2'!A:A,0),12)), \"\", INDEX('Application V2'!A:M, MATCH(Application.!A532,'Application V2'!A:A,0),12))=0, \"\", IF(ISNA(INDEX('Application V2'!A:M, MATCH(Application.!A532,'Application V2'!A:A,0),12)), \"\", INDEX('Application V2'!A:M, MATCH(Application.!A532,'Application V2'!A:A,0),12)))","v":""},null,null,null,null,null,null,null,"sceneSelectConcat"]
[494,533,null,"i ","   "," e",null,"Manual switch","sceneSelectSwitch","boolean",null,null,null,null,false,{"$f":"IF(O533=TRUE,\"Yes\", \"No\")","v":"No"},{"$f":"IF(IF(ISNA(INDEX('Application V2'!A:M, MATCH(Application.!A533,'Application V2'!A:A,0),12)), \"\", INDEX('Application V2'!A:M, MATCH(Application.!A533,'Application V2'!A:A,0),12))=0, \"\", IF(ISNA(INDEX('Application V2'!A:M, MATCH(Application.!A533,'Application V2'!A:A,0),12)), \"\", INDEX('Application V2'!A:M, MATCH(Application.!A533,'Application V2'!A:A,0),12)))","v":""},null,null,null,null,null,null,null,"sceneSelectSwitch"]
[495,534,null,"i ","   "," e",null,"Graphical User Interface","sceneSelectGui","boolean",null,null,null,null,false,{"$f":"IF(O534=TRUE,\"Yes\", \"No\")","v":"No"},{"$f":"IF(IF(ISNA(INDEX('Application V2'!A:M, MATCH(Application.!A534,'Application V2'!A:A,0),12)), \"\", INDEX('Application V2'!A:M, MATCH(Application.!A534,'Application V2'!A:A,0),12))=0, \"\", IF(ISNA(INDEX('Application V2'!A:M, MATCH(Application.!A534,'Application V2'!A:A,0),12)), \"\", INDEX('Application V2'!A:M, MATCH(Application.!A534,'Application V2'!A:A,0),12)))","v":""},null,null,null,null,null,null,null,"sceneSelectGui"]
[496,535,null,"i ","   "," e",null,"BMS (Building Management System)","sceneSelectBms","boolean",null,null,null,null,false,{"$f":"IF(O535=TRUE,\"Yes\", \"No\")","v":"No"},{"$f":"IF(IF(ISNA(INDEX('Application V2'!A:M, MATCH(Application.!A535,'Application V2'!A:A,0),12)), \"\", INDEX('Application V2'!A:M, MATCH(Application.!A535,'Application V2'!A:A,0),12))=0, \"\", IF(ISNA(INDEX('Application V2'!A:M, MATCH(Application.!A535,'Application V2'!A:A,0),12)), \"\", INDEX('Application V2'!A:M, MATCH(Application.!A535,'Application V2'!A:A,0),12)))","v":""},null,null,null,null,null,null,null,"sceneSelectBms"]
[497,536,"  ","i ","   "," e",null,"API","sceneSelectApi","boolean",null,null,null,null,false,{"$f":"IF(O536=TRUE,\"Yes\", \"No\")","v":"No"},{"$f":"IF(IF(ISNA(INDEX('Application V2'!A:M, MATCH(Application.!A536,'Application V2'!A:A,0),12)), \"\", INDEX('Application V2'!A:M, MATCH(Application.!A536,'Application V2'!A:A,0),12))=0, \"\", IF(ISNA(INDEX('Application V2'!A:M, MATCH(Application.!A536,'Application V2'!A:A,0),12)), \"\", INDEX('Application V2'!A:M, MATCH(Application.!A536,'Application V2'!A:A,0),12)))","v":""},null,null,null,null,null,null,null,"sceneSelectApi"]
[498,537,null,"i ","   "," e",null,"Other (explain)","sceneSelectOther","text",null,null,null,null,null,{"$f":"IF(ISBLANK(M537),\"\",M537)","v":""},{"$f":"IF(IF(ISNA(INDEX('Application V2'!A:M, MATCH(Application.!A537,'Application V2'!A:A,0),12)), \"\", INDEX('Application V2'!A:M, MATCH(Application.!A537,'Application V2'!A:A,0),12))=0, \"\", IF(ISNA(INDEX('Application V2'!A:M, MATCH(Application.!A537,'Application V2'!A:A,0),12)), \"\", INDEX('Application V2'!A:M, MATCH(Application.!A537,'Application V2'!A:A,0),12)))","v":""},null,null,null,null,null,null,null,"sceneSelectOther"]
[499,538,"  ","i ","   "," e","23)","Scenes","blank",null,null,null,null,null,null,null,{"$f":"IF(IF(ISNA(INDEX('Application V2'!A:M, MATCH(Application.!A538,'Application V2'!A:A,0),12)), \"\", INDEX('Application V2'!A:M, MATCH(Application.!A538,'Application V2'!A:A,0),12))=0, \"\", IF(ISNA(INDEX('Application V2'!A:M, MATCH(Application.!A538,'Application V2'!A:A,0),12)), \"\", INDEX('Application V2'!A:M, MATCH(Application.!A538,'Application V2'!A:A,0),12)))","v":""},null,null,null,null,null,null,null,"blank"]
[500,539,"I ","  ","E","   ","24)","Manufacturer and System ","blank",null,null,null,null,null,null,null,{"$f":"IF(IF(ISNA(INDEX('Application V2'!A:M, MATCH(Application.!A539,'Application V2'!A:A,0),12)), \"\", INDEX('Application V2'!A:M, MATCH(Application.!A539,'Application V2'!A:A,0),12))=0, \"\", IF(ISNA(INDEX('Application V2'!A:M, MATCH(Application.!A539,'Application V2'!A:A,0),12)), \"\", INDEX('Application V2'!A:M, MATCH(Application.!A539,'Application V2'!A:A,0),12)))","v":""},null,null,null,null,null,null,null,"blank"]
[501,540,"  ","i ","   "," e","Company:",null,"manufCompany","text",null,null,null,null,null,{"$f":"IF(ISBLANK(M540),\"\",M540)","v":""},{"$f":"IF(IF(ISNA(INDEX('Application V2'!A:M, MATCH(Application.!A540,'Application V2'!A:A,0),12)), \"\", INDEX('Application V2'!A:M, MATCH(Application.!A540,'Application V2'!A:A,0),12))=0, \"\", IF(ISNA(INDEX('Application V2'!A:M, MATCH(Application.!A540,'Application V2'!A:A,0),12)), \"\", INDEX('Application V2'!A:M, MATCH(Application.!A540,'Application V2'!A:A,0),12)))","v":""},null,null,null,null,null,null,null,"manufCompany"]
[502,541,"  ","i ","   "," e","Brand:",null,"manufBrand","text",null,null,null,null,null,{"$f":"IF(ISBLANK(M541),\"\",M541)","v":""},{"$f":"IF(IF(ISNA(INDEX('Application V2'!A:M, MATCH(Application.!A541,'Application V2'!A:A,0),12)), \"\", INDEX('Application V2'!A:M, MATCH(Application.!A541,'Application V2'!A:A,0),12))=0, \"\", IF(ISNA(INDEX('Application V2'!A:M, MATCH(Application.!A541,'Application V2'!A:A,0),12)), \"\", INDEX('Application V2'!A:M, MATCH(Application.!A541,'Application V2'!A:A,0),12)))","v":""},null,null,null,null,null,null,null,"manufBrand"]
[503,542,"  ","i ","   "," e","Website:",null,"manufWebsite","URL",null,null,null,null,null,"",{"$f":"IF(IF(ISNA(INDEX('Application V2'!A:M, MATCH(Application.!A542,'Application V2'!A:A,0),12)), \"\", INDEX('Application V2'!A:M, MATCH(Application.!A542,'Application V2'!A:A,0),12))=0, \"\", IF(ISNA(INDEX('Application V2'!A:M, MATCH(Application.!A542,'Application V2'!A:A,0),12)), \"\", INDEX('Application V2'!A:M, MATCH(Application.!A542,'Application V2'!A:A,0),12)))","v":""},null,null,null,null,null,null,null,"manufWebsite"]
[504,543,"  ","i ","   "," e","Primary contact name:",null,"manufContactName1","text",null,null,null,null,null,"",{"$f":"IF(IF(ISNA(INDEX('Application V2'!A:M, MATCH(Application.!A543,'Application V2'!A:A,0),12)), \"\", INDEX('Application V2'!A:M, MATCH(Application.!A543,'Application V2'!A:A,0),12))=0, \"\", IF(ISNA(INDEX('Application V2'!A:M, MATCH(Application.!A543,'Application V2'!A:A,0),12)), \"\", INDEX('Application V2'!A:M, MATCH(Application.!A543,'Application V2'!A:A,0),12)))","v":""},null,null,null,null,null,null,1,"manufContactName1"]
[505,544,"  ","i ","   "," e",null,"Phone:","manufContactPhone1","phone #",null,null,null,null,null,"",{"$f":"IF(IF(ISNA(INDEX('Application V2'!A:M, MATCH(Application.!A544,'Application V2'!A:A,0),12)), \"\", INDEX('Application V2'!A:M, MATCH(Application.!A544,'Application V2'!A:A,0),12))=0, \"\", IF(ISNA(INDEX('Application V2'!A:M, MATCH(Application.!A544,'Application V2'!A:A,0),12)), \"\", INDEX('Application V2'!A:M, MATCH(Application.!A544,'Application V2'!A:A,0),12)))","v":""},null,null,null,null,null,null,1,"manufContactPhone1"]
[506,545,"  ","i ","   "," e",null,"Email:","manufContactEmail1","email",null,null,null,null,null,"",{"$f":"IF(IF(ISNA(INDEX('Application V2'!A:M, MATCH(Application.!A545,'Application V2'!A:A,0),12)), \"\", INDEX('Application V2'!A:M, MATCH(Application.!A545,'Application V2'!A:A,0),12))=0, \"\", IF(ISNA(INDEX('Application V2'!A:M, MATCH(Application.!A545,'Application V2'!A:A,0),12)), \"\", INDEX('Application V2'!A:M, MATCH(Application.!A545,'Application V2'!A:A,0),12)))","v":""},null,null,null,null,null,null,1,"manufContactEmail1"]
[507,546,null,"i ","   "," e",null,"Main time zone for office hours:","manufTimeZone","text",null,null,null,null,null,"",{"$f":"IF(IF(ISNA(INDEX('Application V2'!A:M, MATCH(Application.!A546,'Application V2'!A:A,0),12)), \"\", INDEX('Application V2'!A:M, MATCH(Application.!A546,'Application V2'!A:A,0),12))=0, \"\", IF(ISNA(INDEX('Application V2'!A:M, MATCH(Application.!A546,'Application V2'!A:A,0),12)), \"\", INDEX('Application V2'!A:M, MATCH(Application.!A546,'Application V2'!A:A,0),12)))","v":""},null,null,null,null,null,null,1,"manufTimeZone"]
[508,547,"  ","i ","   "," e","Optional second contact name for email cc:",null,"manufContactName2","text",null,null,null,null,null,"",{"$f":"IF(IF(ISNA(INDEX('Application V2'!A:M, MATCH(Application.!A547,'Application V2'!A:A,0),12)), \"\", INDEX('Application V2'!A:M, MATCH(Application.!A547,'Application V2'!A:A,0),12))=0, \"\", IF(ISNA(INDEX('Application V2'!A:M, MATCH(Application.!A547,'Application V2'!A:A,0),12)), \"\", INDEX('Application V2'!A:M, MATCH(Application.!A547,'Application V2'!A:A,0),12)))","v":""},null,null,null,null,null,null,1,"manufContactName2"]
[509,548,"  ","i ","   "," e",null,"Phone:","manufContactPhone2","phone #",null,null,null,null,null,"",{"$f":"IF(IF(ISNA(INDEX('Application V2'!A:M, MATCH(Application.!A548,'Application V2'!A:A,0),12)), \"\", INDEX('Application V2'!A:M, MATCH(Application.!A548,'Application V2'!A:A,0),12))=0, \"\", IF(ISNA(INDEX('Application V2'!A:M, MATCH(Application.!A548,'Application V2'!A:A,0),12)), \"\", INDEX('Application V2'!A:M, MATCH(Application.!A548,'Application V2'!A:A,0),12)))","v":""},null,null,null,null,null,null,1,"manufContactPhone2"]
[510,549,"  ","i ","   "," e",null,"Email:","manufContactEmail2","email",null,null,null,null,null,"",{"$f":"IF(IF(ISNA(INDEX('Application V2'!A:M, MATCH(Application.!A549,'Application V2'!A:A,0),12)), \"\", INDEX('Application V2'!A:M, MATCH(Application.!A549,'Application V2'!A:A,0),12))=0, \"\", IF(ISNA(INDEX('Application V2'!A:M, MATCH(Application.!A549,'Application V2'!A:A,0),12)), \"\", INDEX('Application V2'!A:M, MATCH(Application.!A549,'Application V2'!A:A,0),12)))","v":""},null,null,null,null,null,null,1,"manufContactEmail2"]
[511,550,"  ","\n \n i ","   "," e","Name of Control System being submitted.\nThis is the primary product and marketing name for the whole system; not detailed names of particular system components.  The complete system is marketed under this name.",null,"manufProduct","text",null,null,null,null,null,"",{"$f":"IF(IF(ISNA(INDEX('Application V2'!A:M, MATCH(Application.!A550,'Application V2'!A:A,0),12)), \"\", INDEX('Application V2'!A:M, MATCH(Application.!A550,'Application V2'!A:A,0),12))=0, \"\", IF(ISNA(INDEX('Application V2'!A:M, MATCH(Application.!A550,'Application V2'!A:A,0),12)), \"\", INDEX('Application V2'!A:M, MATCH(Application.!A550,'Application V2'!A:A,0),12)))","v":""},null,null,null,null,null,null,null,"manufProduct"]
[512,551,"  ","i\n","   "," e","Application Type (Choose only 1 type per Application, from dropdown menu).  For multiple types, qualify one type first.  Then start from a copy of the final Application file, to qualify the other type)",null,"productTypeConcat","text",null,null,null,null,null,"",{"$f":"IF(IF(ISNA(INDEX('Application V2'!A:M, MATCH(Application.!A551,'Application V2'!A:A,0),12)), \"\", INDEX('Application V2'!A:M, MATCH(Application.!A551,'Application V2'!A:A,0),12))=0, \"\", IF(ISNA(INDEX('Application V2'!A:M, MATCH(Application.!A551,'Application V2'!A:A,0),12)), \"\", INDEX('Application V2'!A:M, MATCH(Application.!A551,'Application V2'!A:A,0),12)))","v":""},null,null,null,null,null,null,null,"productTypeConcat"]
[513,552,".","i ","   "," e","Will any derivative products based on this application be submitted later? (e.g. Exterior after Interior, or Private Label).  ",null,"productParent","boolean",null,null,null,null,false,{"$f":"IF(O552=TRUE,\"Yes\", \"No\")","v":"No"},{"$f":"IF(IF(ISNA(INDEX('Application V2'!A:M, MATCH(Application.!A552,'Application V2'!A:A,0),12)), \"\", INDEX('Application V2'!A:M, MATCH(Application.!A552,'Application V2'!A:A,0),12))=0, \"\", IF(ISNA(INDEX('Application V2'!A:M, MATCH(Application.!A552,'Application V2'!A:A,0),12)), \"\", INDEX('Application V2'!A:M, MATCH(Application.!A552,'Application V2'!A:A,0),12)))","v":""},null,null,null,null,null,null,1,"productParent"]
[514,553,null,"i ","   "," e",null,"If so, product name(s) and relationship to this parent:","productChildren","text",null,null,null,null,null,{"$f":"M553","v":0},{"$f":"IF(IF(ISNA(INDEX('Application V2'!A:M, MATCH(Application.!A553,'Application V2'!A:A,0),12)), \"\", INDEX('Application V2'!A:M, MATCH(Application.!A553,'Application V2'!A:A,0),12))=0, \"\", IF(ISNA(INDEX('Application V2'!A:M, MATCH(Application.!A553,'Application V2'!A:A,0),12)), \"\", INDEX('Application V2'!A:M, MATCH(Application.!A553,'Application V2'!A:A,0),12)))","v":""},null,null,null,null,null,null,1,"productChildren"]
[515,554,".","i ","   ",null,"Interior System Scope/Scale (note that Energy Monitoring is required for all scales except \"Room or Zone\")",null,"productInteriorScopeConcat","concat 555:558",null,null,"Select all that apply",null,null,null,{"$f":"IF(IF(ISNA(INDEX('Application V2'!A:M, MATCH(Application.!A554,'Application V2'!A:A,0),12)), \"\", INDEX('Application V2'!A:M, MATCH(Application.!A554,'Application V2'!A:A,0),12))=0, \"\", IF(ISNA(INDEX('Application V2'!A:M, MATCH(Application.!A554,'Application V2'!A:A,0),12)), \"\", INDEX('Application V2'!A:M, MATCH(Application.!A554,'Application V2'!A:A,0),12)))","v":""},null,null,null,null,null,null,null,"productInteriorScopeConcat"]
[516,555,"  ","i ","   ",null,null,"Portfolio/Enterprise ","productInteriorScopeEnterprise","boolean",null,null,null,null,false,{"$f":"IF(O555=TRUE,\"Yes\", \"No\")","v":"No"},{"$f":"IF(IF(ISNA(INDEX('Application V2'!A:M, MATCH(Application.!A555,'Application V2'!A:A,0),12)), \"\", INDEX('Application V2'!A:M, MATCH(Application.!A555,'Application V2'!A:A,0),12))=0, \"\", IF(ISNA(INDEX('Application V2'!A:M, MATCH(Application.!A555,'Application V2'!A:A,0),12)), \"\", INDEX('Application V2'!A:M, MATCH(Application.!A555,'Application V2'!A:A,0),12)))","v":""},null,null,null,null,null,null,null,"productInteriorScopeEnterprise"]
[517,556,"  ","i ","   ",null,null,"Whole Building","productInteriorScopeBuilding","boolean",null,null,null,null,false,{"$f":"IF(O556=TRUE,\"Yes\", \"No\")","v":"No"},{"$f":"IF(IF(ISNA(INDEX('Application V2'!A:M, MATCH(Application.!A556,'Application V2'!A:A,0),12)), \"\", INDEX('Application V2'!A:M, MATCH(Application.!A556,'Application V2'!A:A,0),12))=0, \"\", IF(ISNA(INDEX('Application V2'!A:M, MATCH(Application.!A556,'Application V2'!A:A,0),12)), \"\", INDEX('Application V2'!A:M, MATCH(Application.!A556,'Application V2'!A:A,0),12)))","v":""},null,null,null,null,null,null,null,"productInteriorScopeBuilding"]
[518,557,null,"i","   ",null,null,"Room or Zone","productInteriorScopeRoom","boolean",null,null,null,null,false,{"$f":"IF(O557=TRUE,\"Yes\", \"No\")","v":"No"},{"$f":"IF(IF(ISNA(INDEX('Application V2'!A:M, MATCH(Application.!A557,'Application V2'!A:A,0),12)), \"\", INDEX('Application V2'!A:M, MATCH(Application.!A557,'Application V2'!A:A,0),12))=0, \"\", IF(ISNA(INDEX('Application V2'!A:M, MATCH(Application.!A557,'Application V2'!A:A,0),12)), \"\", INDEX('Application V2'!A:M, MATCH(Application.!A557,'Application V2'!A:A,0),12)))","v":""},null,null,null,null,null,null,null,"productInteriorScopeRoom"]
[519,558,null,"i",null,null,null,"Structured Parking","productInteriorScopeGarage","boolean",null,null,null,null,false,{"$f":"IF(O558=TRUE,\"Yes\", \"No\")","v":"No"},{"$f":"IF(IF(ISNA(INDEX('Application V2'!A:M, MATCH(Application.!A558,'Application V2'!A:A,0),12)), \"\", INDEX('Application V2'!A:M, MATCH(Application.!A558,'Application V2'!A:A,0),12))=0, \"\", IF(ISNA(INDEX('Application V2'!A:M, MATCH(Application.!A558,'Application V2'!A:A,0),12)), \"\", INDEX('Application V2'!A:M, MATCH(Application.!A558,'Application V2'!A:A,0),12)))","v":""},null,null,null,null,null,null,null,"productInteriorScopeGarage"]
[520,559,null,"i",null,"e","If the scope is smaller than Enterprise, is an upgrade path available to become part of an Enterprise system?",null,"productUpgradeToEnterprise","boolean",null,null,null,null,false,{"$f":"IF(O559=TRUE,\"Yes\", \"No\")","v":"No"},{"$f":"IF(IF(ISNA(INDEX('Application V2'!A:M, MATCH(Application.!A559,'Application V2'!A:A,0),12)), \"\", INDEX('Application V2'!A:M, MATCH(Application.!A559,'Application V2'!A:A,0),12))=0, \"\", IF(ISNA(INDEX('Application V2'!A:M, MATCH(Application.!A559,'Application V2'!A:A,0),12)), \"\", INDEX('Application V2'!A:M, MATCH(Application.!A559,'Application V2'!A:A,0),12)))","v":""},null,null,null,null,null,null,null,"productUpgradeToEnterprise"]
[521,560,null,"i",null,"e",null,"If yes, name of the Enterprise system","productUpgradeToEnterpriseName","text",null,null,null,null,null,{"$f":"IF(ISBLANK(M560),\"\",M560)","v":""},{"$f":"IF(IF(ISNA(INDEX('Application V2'!A:M, MATCH(Application.!A560,'Application V2'!A:A,0),12)), \"\", INDEX('Application V2'!A:M, MATCH(Application.!A560,'Application V2'!A:A,0),12))=0, \"\", IF(ISNA(INDEX('Application V2'!A:M, MATCH(Application.!A560,'Application V2'!A:A,0),12)), \"\", INDEX('Application V2'!A:M, MATCH(Application.!A560,'Application V2'!A:A,0),12)))","v":""},null,null,null,null,null,null,null,"productUpgradeToEnterpriseName"]
[522,561,null,null," ","e","Exterior System Application ",null,"productExteriorScopeConcat","concat 562:566",null,null,"Select all that apply",null,null,null,{"$f":"IF(IF(ISNA(INDEX('Application V2'!A:M, MATCH(Application.!A561,'Application V2'!A:A,0),12)), \"\", INDEX('Application V2'!A:M, MATCH(Application.!A561,'Application V2'!A:A,0),12))=0, \"\", IF(ISNA(INDEX('Application V2'!A:M, MATCH(Application.!A561,'Application V2'!A:A,0),12)), \"\", INDEX('Application V2'!A:M, MATCH(Application.!A561,'Application V2'!A:A,0),12)))","v":""},null,null,null,null,null,null,null,"productExteriorScopeConcat"]
[523,562,null,null,null,"e",null,"Structured Parking","productExteriorScopeGarage","boolean",null,null,null,null,false,{"$f":"IF(O562=TRUE,\"Yes\", \"No\")","v":"No"},{"$f":"IF(IF(ISNA(INDEX('Application V2'!A:M, MATCH(Application.!A562,'Application V2'!A:A,0),12)), \"\", INDEX('Application V2'!A:M, MATCH(Application.!A562,'Application V2'!A:A,0),12))=0, \"\", IF(ISNA(INDEX('Application V2'!A:M, MATCH(Application.!A562,'Application V2'!A:A,0),12)), \"\", INDEX('Application V2'!A:M, MATCH(Application.!A562,'Application V2'!A:A,0),12)))","v":""},null,null,null,null,null,null,null,"productExteriorScopeGarage"]
[524,563,null,null," ","e",null,"Area/Building Exterior/Parking","productExteriorScopeArea","boolean",null,null,null,null,false,{"$f":"IF(O563=TRUE,\"Yes\", \"No\")","v":"No"},{"$f":"IF(IF(ISNA(INDEX('Application V2'!A:M, MATCH(Application.!A563,'Application V2'!A:A,0),12)), \"\", INDEX('Application V2'!A:M, MATCH(Application.!A563,'Application V2'!A:A,0),12))=0, \"\", IF(ISNA(INDEX('Application V2'!A:M, MATCH(Application.!A563,'Application V2'!A:A,0),12)), \"\", INDEX('Application V2'!A:M, MATCH(Application.!A563,'Application V2'!A:A,0),12)))","v":""},null,null,null,null,null,null,null,"productExteriorScopeArea"]
[525,564,null,null," ","e",null,"Roadway  (highways)","productExteriorScopeRoadway","boolean",null,null,null,null,false,{"$f":"IF(O564=TRUE,\"Yes\", \"No\")","v":"No"},{"$f":"IF(IF(ISNA(INDEX('Application V2'!A:M, MATCH(Application.!A564,'Application V2'!A:A,0),12)), \"\", INDEX('Application V2'!A:M, MATCH(Application.!A564,'Application V2'!A:A,0),12))=0, \"\", IF(ISNA(INDEX('Application V2'!A:M, MATCH(Application.!A564,'Application V2'!A:A,0),12)), \"\", INDEX('Application V2'!A:M, MATCH(Application.!A564,'Application V2'!A:A,0),12)))","v":""},null,null,null,null,null,null,null,"productExteriorScopeRoadway"]
[526,565,null,null," ","e",null,"Streetlight (residential streets)","productExteriorScopeStreetlight","boolean",null,null,null,null,false,{"$f":"IF(O565=TRUE,\"Yes\", \"No\")","v":"No"},{"$f":"IF(IF(ISNA(INDEX('Application V2'!A:M, MATCH(Application.!A565,'Application V2'!A:A,0),12)), \"\", INDEX('Application V2'!A:M, MATCH(Application.!A565,'Application V2'!A:A,0),12))=0, \"\", IF(ISNA(INDEX('Application V2'!A:M, MATCH(Application.!A565,'Application V2'!A:A,0),12)), \"\", INDEX('Application V2'!A:M, MATCH(Application.!A565,'Application V2'!A:A,0),12)))","v":""},null,null,null,null,null,null,null,"productExteriorScopeStreetlight"]
[527,566,null,null," ","e",null,"Smart City","productExteriorScopeCity","boolean",null,null,null,null,false,{"$f":"IF(O566=TRUE,\"Yes\", \"No\")","v":"No"},{"$f":"IF(IF(ISNA(INDEX('Application V2'!A:M, MATCH(Application.!A566,'Application V2'!A:A,0),12)), \"\", INDEX('Application V2'!A:M, MATCH(Application.!A566,'Application V2'!A:A,0),12))=0, \"\", IF(ISNA(INDEX('Application V2'!A:M, MATCH(Application.!A566,'Application V2'!A:A,0),12)), \"\", INDEX('Application V2'!A:M, MATCH(Application.!A566,'Application V2'!A:A,0),12)))","v":""},null,null,null,null,null,null,null,"productExteriorScopeCity"]
[528,567,"  ","i ","   "," e","Product website",null,"productWebsite","URL",null,null,null,null,null,{"$f":"IF(ISBLANK(M567),\"\",M567)","v":""},{"$f":"IF(IF(ISNA(INDEX('Application V2'!A:M, MATCH(Application.!A567,'Application V2'!A:A,0),12)), \"\", INDEX('Application V2'!A:M, MATCH(Application.!A567,'Application V2'!A:A,0),12))=0, \"\", IF(ISNA(INDEX('Application V2'!A:M, MATCH(Application.!A567,'Application V2'!A:A,0),12)), \"\", INDEX('Application V2'!A:M, MATCH(Application.!A567,'Application V2'!A:A,0),12)))","v":""},null,null,null,null,null,null,null,"productWebsite"]
[529,568,".","i ","   "," e","Is a case study or promotional guide available for any specific market vertical(s) where product marketing is focused?",null,"verticalConcat","concat 569:587",null,null,"Select all that apply",null,null,null,null,null,null,null,null,null,null,null,"verticalConcat"]
[530,569,null,"i ","   "," e",null,"Automotive facility","verticalAutomotive","boolean",null,null,null,null,false,{"$f":"IF(O569=TRUE,\"Yes\", \"No\")","v":"No"},null,null,null,null,null,null,null,null,"verticalAutomotive"]
[531,570,null,"i ","   ",null,null,"Convention center","verticalConvention","boolean",null,null,null,null,false,{"$f":"IF(O570=TRUE,\"Yes\", \"No\")","v":"No"},null,null,null,null,null,null,null,null,"verticalConvention"]
[532,571,null,"i ","   ",null,null,"Dining","verticalDining","boolean",null,null,null,null,false,"No",null,null,null,null,null,null,null,null,"verticalDining"]
[533,572,null,"i ","   ",null,null,"Dormitory","verticalDormitory","boolean",null,null,null,null,false,"No",null,null,null,null,null,null,null,null,"verticalDormitory"]
[534,573,null,"i ","   ",null,null,"Gymnasium","verticalGymnasium","boolean",null,null,null,null,false,"No",null,null,null,null,null,null,null,null,"verticalGymnasium"]
[535,574,null,"i ","   ",null,null,"Healthcare clinic","verticalHealthcare","boolean",null,null,null,null,false,"No",null,null,null,null,null,null,null,null,"verticalHealthcare"]
[536,575,null,"i ","   ",null,null,"Hospital","verticalHospital","boolean",null,null,null,null,false,"No",null,null,null,null,null,null,null,null,"verticalHospital"]
[537,576,null,"i ","   ",null,null,"Hotel/motel","verticalHotel","boolean",null,null,null,null,false,"No",null,null,null,null,null,null,null,null,"verticalHotel"]
[538,577,null,"i ","   ",null,null,"Manufacturing","verticalManufacturing","boolean",null,null,null,null,false,"No",null,null,null,null,null,null,null,null,"verticalManufacturing"]
[539,578,null,"i ","   ",null,null,"Multifamily","verticalMultifamily","boolean",null,null,null,null,false,"No",null,null,null,null,null,null,null,null,"verticalMultifamily"]
[540,579,null,"i ","   ",null,null,"Museum","verticalMuseum","boolean",null,null,null,null,false,"No",null,null,null,null,null,null,null,null,"verticalMuseum"]
[541,580,null,"i ","   ",null,null,"Office","verticalOffice","boolean",null,null,null,null,false,{"$f":"IF(O580=TRUE,\"Yes\", \"No\")","v":"No"},null,null,null,null,null,null,null,null,"verticalOffice"]
[542,581,null,"i ","   "," e",null,"Parking garage","verticalParking","boolean",null,null,null,null,false,"No",null,null,null,null,null,null,null,null,"verticalParking"]
[543,582,null,"i ","   ",null,null,"Retail","verticalRetail","boolean",null,null,null,null,false,"No",null,null,null,null,null,null,null,null,"verticalRetail"]
[544,583,null,"i ","   ",null,null,"School/university","verticalSchool","boolean",null,null,null,null,false,"No",null,null,null,null,null,null,null,null,"verticalSchool"]
[545,584,null,"i ","   "," e",null,"Sports arena","verticalSports","boolean",null,null,null,null,false,"No",null,null,null,null,null,null,null,null,"verticalSports"]
[546,585,null,"i ","   ",null,null,"Theater","verticalTheater","boolean",null,null,null,null,false,"No",null,null,null,null,null,null,null,null,"verticalTheater"]
[547,586,null,"i ","   ",null,null,"Warehouse","verticalWarehouse","boolean",null,null,null,null,false,"No",null,null,null,null,null,null,null,null,"verticalWarehouse"]
[548,587,null,"i",null,"e",null,"Other (explain)","verticalOther","text",null,null,null,null,null,{"$f":"IF(ISBLANK(M587),\"\",M587)","v":""},null,null,null,null,null,null,null,null,"verticalOther"]
[548.1,588,null,"i",null,"e","Are there any ongoing software license requirements?",null,"productLicenseReq","boolean",null,null,null,null,false,"No"]
[548.20000000000005,589,null,"i",null,"e",null,"If yes, is there an annual fee?","productLicenseFees","boolean",null,null,null,null,false,"No"]
[549,590," I \n\n   "," ","E\n ","\n ","Do all system components have a warranty of 5 years or more, including any 3rd party components that are needed to meet minimum required DLC capabilities (with the possible exception of software, on-premises server, and cloud service)?  Attach the warranty.",null,"hasProductWarranty","boolean",null,null,null,null,false,{"$f":"IF(O590=TRUE,\"Yes\", \"No\")","v":"No"},{"$f":"IF(IF(ISNA(INDEX('Application V2'!A:M, MATCH(Application.!A590,'Application V2'!A:A,0),12)), \"\", INDEX('Application V2'!A:M, MATCH(Application.!A590,'Application V2'!A:A,0),12))=0, \"\", IF(ISNA(INDEX('Application V2'!A:M, MATCH(Application.!A590,'Application V2'!A:A,0),12)), \"\", INDEX('Application V2'!A:M, MATCH(Application.!A590,'Application V2'!A:A,0),12)))","v":""},null,null,null,null,null,null,null,"hasProductWarranty"]
[550,591,"  \n ","i \n ","   \n "," e","Does an extended warranty need to be purchased, to meet the 5 year requirement?",null,"productWarrantyExtension","boolean",null,null,null,null,false,{"$f":"IF(O591=TRUE,\"Yes\", \"No\")","v":"No"},{"$f":"IF(IF(ISNA(INDEX('Application V2'!A:M, MATCH(Application.!A591,'Application V2'!A:A,0),12)), \"\", INDEX('Application V2'!A:M, MATCH(Application.!A591,'Application V2'!A:A,0),12))=0, \"\", IF(ISNA(INDEX('Application V2'!A:M, MATCH(Application.!A591,'Application V2'!A:A,0),12)), \"\", INDEX('Application V2'!A:M, MATCH(Application.!A591,'Application V2'!A:A,0),12)))","v":""},null,null,null,null,null,null,null,"productWarrantyExtension"]
[551,592,"  ","i ","   ","e","What is the standard warranty length?",null,"productWarrantyStandardLength","real",null,null,null,null,null,{"$f":"IF(ISBLANK(M592),\"\",M592)","v":""},{"$f":"IF(IF(ISNA(INDEX('Application V2'!A:M, MATCH(Application.!A592,'Application V2'!A:A,0),12)), \"\", INDEX('Application V2'!A:M, MATCH(Application.!A592,'Application V2'!A:A,0),12))=0, \"\", IF(ISNA(INDEX('Application V2'!A:M, MATCH(Application.!A592,'Application V2'!A:A,0),12)), \"\", INDEX('Application V2'!A:M, MATCH(Application.!A592,'Application V2'!A:A,0),12)))","v":""},null,null,null,null,null,null,null,"productWarrantyStandardLength"]
[552,593,"  \n ","i \n ","   \n "," e","Technical support phone number for troubleshooting this system:",null,"productSupportPhone","phone #",null,null,null,null,null,"",{"$f":"IF(IF(ISNA(INDEX('Application V2'!A:M, MATCH(Application.!A593,'Application V2'!A:A,0),12)), \"\", INDEX('Application V2'!A:M, MATCH(Application.!A593,'Application V2'!A:A,0),12))=0, \"\", IF(ISNA(INDEX('Application V2'!A:M, MATCH(Application.!A593,'Application V2'!A:A,0),12)), \"\", INDEX('Application V2'!A:M, MATCH(Application.!A593,'Application V2'!A:A,0),12)))","v":""},null,null,null,null,null,null,null,"productSupportPhone"]
[553,594,"   \n \n \n ","i  \n \n \n ","    \n \n \n "," e \n \n ","Is this a private-label system?  If so, provide a copy of your agreement with the Original Equipment Manufacturer, as the Reference Document.",null,"productPrivateLabel","boolean",null,null,null,null,false,{"$f":"IF(O594=TRUE,\"Yes\", \"No\")","v":"No"},{"$f":"IF(IF(ISNA(INDEX('Application V2'!A:M, MATCH(Application.!A594,'Application V2'!A:A,0),12)), \"\", INDEX('Application V2'!A:M, MATCH(Application.!A594,'Application V2'!A:A,0),12))=0, \"\", IF(ISNA(INDEX('Application V2'!A:M, MATCH(Application.!A594,'Application V2'!A:A,0),12)), \"\", INDEX('Application V2'!A:M, MATCH(Application.!A594,'Application V2'!A:A,0),12)))","v":""},null,null,null,null,null,null,1,"productPrivateLabel"]
[554,595,"  \n ","i \n ","   \n "," e","Is this system a combination of products from multiple manufacturers? ",null,"productMultipleManuf","boolean",null,null,null,null,false,{"$f":"IF(O595=TRUE,\"Yes\", \"No\")","v":"No"},{"$f":"IF(IF(ISNA(INDEX('Application V2'!A:M, MATCH(Application.!A595,'Application V2'!A:A,0),12)), \"\", INDEX('Application V2'!A:M, MATCH(Application.!A595,'Application V2'!A:A,0),12))=0, \"\", IF(ISNA(INDEX('Application V2'!A:M, MATCH(Application.!A595,'Application V2'!A:A,0),12)), \"\", INDEX('Application V2'!A:M, MATCH(Application.!A595,'Application V2'!A:A,0),12)))","v":""},null,null,null,null,null,null,1,"productMultipleManuf"]
[555,596,"  \n ","i \n ","   \n "," e",null," If so, please provide a list of all manufacturers.","productMultipleManufList","text",null,null,null,null,null,{"$f":"IF(ISBLANK(M596),\"\",M596)","v":""},{"$f":"IF(IF(ISNA(INDEX('Application V2'!A:M, MATCH(Application.!A596,'Application V2'!A:A,0),12)), \"\", INDEX('Application V2'!A:M, MATCH(Application.!A596,'Application V2'!A:A,0),12))=0, \"\", IF(ISNA(INDEX('Application V2'!A:M, MATCH(Application.!A596,'Application V2'!A:A,0),12)), \"\", INDEX('Application V2'!A:M, MATCH(Application.!A596,'Application V2'!A:A,0),12)))","v":""},null,null,null,null,null,null,1,"productMultipleManufList"]
[556,597," I \n\n   "," ","E\n ",null,"Provide any case studies in North America available for this system, with URL if available online.",null,"productCaseStudies","text",null,null,null,null,null,"",{"$f":"IF(IF(ISNA(INDEX('Application V2'!A:M, MATCH(Application.!A597,'Application V2'!A:A,0),12)), \"\", INDEX('Application V2'!A:M, MATCH(Application.!A597,'Application V2'!A:A,0),12))=0, \"\", IF(ISNA(INDEX('Application V2'!A:M, MATCH(Application.!A597,'Application V2'!A:A,0),12)), \"\", INDEX('Application V2'!A:M, MATCH(Application.!A597,'Application V2'!A:A,0),12)))","v":""},null,null,null,null,null,null,null,"productCaseStudies"]
[557,598,null,"i \n \n ","\n "," e\n\n  \n ",null,"If no case studies are available, provide a source where the system is commercially available for purchase.  \nOR, to help expedite system qualification, provide a copy of a paid invoice showing that a system has been sold to a customer.","productSource","text",null,null,null,null,null,"",{"$f":"IF(IF(ISNA(INDEX('Application V2'!A:M, MATCH(Application.!A598,'Application V2'!A:A,0),12)), \"\", INDEX('Application V2'!A:M, MATCH(Application.!A598,'Application V2'!A:A,0),12))=0, \"\", IF(ISNA(INDEX('Application V2'!A:M, MATCH(Application.!A598,'Application V2'!A:A,0),12)), \"\", INDEX('Application V2'!A:M, MATCH(Application.!A598,'Application V2'!A:A,0),12)))","v":""},null,null,null,null,null,null,1,"productSource"]
[558,599,"   \n \n \n \n \n","i \n \n \n \n \n","  \n \n \n \n \n"," \n \n e \n \n \n\n  \n",null,"If no case studies are available, then provide a customer reference (name, phone, email) that DLC may contact. DLC will not share this contact with any other parties.  DLC wishes to confirm with an unbiased third party that the system has been installed and operated successfully in at least one actual field installation.  A business partner directly connected to the applicant, such as a lighting sales rep, does not qualify. A beta site with a pre-production system is acceptable, provided that the site does not belong to an applicant's business partner.  DLC WILL VERIFY THAT EACH OF THE \"REQUIRED CAPABILITIES\" HAVE BEEN DEMONSTRATED WITH EITHER A CASE STUDY OR A CUSTOMER REFERENCE.","productFieldContact","text",null,null,null,null,null,"",{"$f":"IF(IF(ISNA(INDEX('Application V2'!A:M, MATCH(Application.!A599,'Application V2'!A:A,0),12)), \"\", INDEX('Application V2'!A:M, MATCH(Application.!A599,'Application V2'!A:A,0),12))=0, \"\", IF(ISNA(INDEX('Application V2'!A:M, MATCH(Application.!A599,'Application V2'!A:A,0),12)), \"\", INDEX('Application V2'!A:M, MATCH(Application.!A599,'Application V2'!A:A,0),12)))","v":""},null,null,null,null,null,null,1,"productFieldContact"]
[559,600,"I \n  \n \n",null,"E\n  \n \n \n",null,"System Overview Presentation:  As part of the Review Process for a new product not previously qualified, or a qualified product with major upgrades since the previous qualification, to help DLC understand the system, the applicant will conduct a 1 to 2 hour overview of the system for DLC via webinar.  This will be scheduled and completed after the Application Form has  been submitted.  See the \"Presentation\" worksheet for more details",null,"blank",null,null,null,null,null,null,{"$f":"IF(ISBLANK(M600),\"\",M600)","v":""},{"$f":"IF(IF(ISNA(INDEX('Application V2'!A:M, MATCH(Application.!A600,'Application V2'!A:A,0),12)), \"\", INDEX('Application V2'!A:M, MATCH(Application.!A600,'Application V2'!A:A,0),12))=0, \"\", IF(ISNA(INDEX('Application V2'!A:M, MATCH(Application.!A600,'Application V2'!A:A,0),12)), \"\", INDEX('Application V2'!A:M, MATCH(Application.!A600,'Application V2'!A:A,0),12)))","v":""},null,null,null,null,null,null,1,"blank"]
[560,601,"I ","  ","E","   ","24)","Manufacturer and System ","blank",null,null,null,null,null,null,null,null,null,null,null,null,null,null,null,"blank"]

{"sheet":"List Box Sources","index":3,"n_rows":42,"n_cols":7,"rows_kept":42,"cut":false,"hidden":true,"merged":[]}
["row of question"]
[null,null,null,null,null,null,"Check"]
[]
["V5 215","Data resolution"]
[null,"Per luminaire"]
[null,"Per zone"]
[null,"Per lighting circuit"]
[null,"Per system"]
[]
[null,null,"is question dependent?","If dependent, what should make this question appear?"]
["V5 187","scheduleLength","Column1","Column2"]
[null,"A day","y","Row 204"]
[null,"A week","y","Row 204"]
[null,"A year","y","Row 204"]
[null,"5 years","y","Row 204"]
[null,"10 years","y","Row 204"]
[null,"No limit","y","Row 204"]
[null,"Other","y","Row 204"]
[]
["V5 47","Either local or cloud server is optional","y"]
[null,"Either local or cloud server is required","y"]
[null,"Local server optional","y"]
[null,"Local server required","y"]
[null,"Cloud server optional","y"]
[null,"Cloud server required","y"]
[]
["V5 551","Interior","y"]
[null,"Exterior","y"]
[]
["V5 31","BLE"]
[null,"BLE mesh (proprietary)"]
[null,"BLE Mesh 1.0 (SIG)"]
[null,"BLE Mesh 1.0.1 (SIG)"]
[]
["V5 249",".CSV"]
[null,"API"]
[null,".CSV, API"]
[]
["V5 467","Tier 1"]
[null,"Tier 2"]
[null,"Tier 3"]
[null,"Tier 4"]

{"sheet":"Presentation Outline.","index":4,"n_rows":0,"n_cols":0,"rows_kept":0,"cut":false,"hidden":false,"merged":[]}

{"sheet":"Notes for programming","index":5,"n_rows":0,"n_cols":0,"rows_kept":0,"cut":false,"hidden":true,"merged":[]}