{"text_format":"1","workbook":"xlsx","n_sheets":6,"sheets":["Application V2","Instructions.","Application.","List Box Sources","Presentation Outline.","Notes for programming"],"not_rendered":{"charts":0,"images":3,"macros":1,"external_links":1,"defined_names":6,"comments":0,"pivot_tables":0},"unopened":[],"bounds":{"document_bytes":16777216,"sheet_cells":100000,"rows_first":2000,"rows_last":500,"rows_between":2000,"halvings":0,"cell_chars":16384,"cell_head_chars":4096},"cells_cut":0,"cells_raw":0,"read":"whole","date_system":"1900"}

{"sheet":"Application V2","index":0,"n_rows":583,"n_cols":17,"rows_kept":583,"cut":false,"hidden":true,"merged":[[374,5,374,6],[347,5,347,6],[348,5,348,6],[375,5,375,6],[386,5,386,6],[387,5,387,6],[388,5,388,6],[351,5,351,6],[352,5,352,6],[353,5,353,6],[363,5,363,6],[238,5,238,6],[243,5,243,6],[247,5,247,6],[152,5,152,6],[153,5,153,6],[154,5,154,6],[223,5,223,6],[231,5,231,6],[242,5,242,6],[519,5,519,6],[275,5,275,6],[303,5,303,6],[451,5,451,6],[331,5,331,6],[164,5,164,6],[169,5,169,6],[173,5,173,6],[191,5,191,6],[192,5,192,6],[193,5,193,6],[201,5,201,6],[202,5,202,6],[203,5,203,6],[204,5,204,6],[215,5,215,6],[216,5,216,6],[217,5,217,6],[211,5,211,6],[494,5,494,6],[212,5,212,6],[408,5,408,6],[409,5,409,6],[205,5,205,6],[135,5,135,6],[136,5,136,6],[137,5,137,6],[139,5,139,6],[149,5,149,6],[88,5,88,6],[94,5,94,6],[95,5,95,6],[96,5,96,6],[97,5,97,6],[118,5,118,6],[119,5,119,6],[120,5,120,6],[123,5,123,6],[125,5,125,6],[130,5,130,6],[134,5,134,6],[127,5,127,6],[128,5,128,6],[131,5,131,6],[141,5,141,6],[144,5,144,6],[145,5,145,6],[148,5,148,6],[0,5,0,6],[82,5,82,6],[62,5,62,6],[3,5,3,6],[4,5,4,6],[2,5,2,6],[11,5,11,6],[20,5,20,6],[46,5,46,6],[63,5,63,6],[64,5,64,6],[65,5,65,6],[66,5,66,6],[74,5,74,6],[19,5,19,6],[16,5,16,6],[57,5,57,6],[411,5,411,6],[415,5,415,6],[398,5,398,6],[399,5,399,6],[400,5,400,6],[389,5,389,6],[390,5,390,6],[393,5,393,6],[394,5,394,6],[432,5,432,6],[436,5,436,6],[437,5,437,6],[442,5,442,6],[416,5,416,6],[417,5,417,6],[418,5,418,6],[425,5,425,6],[427,5,427,6],[433,5,433,6],[438,5,438,6],[500,5,500,6],[511,5,511,6],[512,5,512,6],[477,5,477,6],[479,5,479,6],[495,5,495,6],[496,5,496,6],[497,5,497,6],[454,5,454,6],[455,5,455,6],[456,5,456,6],[462,5,462,6],[476,5,476,6],[581,5,581,6],[571,5,571,6],[572,5,572,6],[574,5,574,6],[575,5,575,6],[576,5,576,6],[552,5,552,6],[555,5,555,6],[556,5,556,6],[559,5,559,6],[561,5,561,6],[538,5,538,6],[112,5,112,6],[113,5,113,6],[114,5,114,6],[101,5,101,6],[102,5,102,6],[103,5,103,6],[111,5,111,6],[578,5,578,6],[537,5,537,6],[546,5,546,6],[547,5,547,6],[548,5,548,6],[549,5,549,6],[527,5,527,6],[528,5,528,6],[529,5,529,6],[244,5,244,6],[245,5,245,6],[522,5,522,6],[523,5,523,6],[524,5,524,6],[498,5,498,6],[499,5,499,6]]}
["Row #","Required Interior","reported interior","Required Exterior","reported exterior","Capability  (Select '+' on the left to see questions)",null,"\n \n \n \n \n Brief Answer for QPL","Hide   True/ False from check boxes","Hide. Converts \"True/False\" to \"Yes/No\" or copies text when checkboxes not used. Column J is data for QPL","Reference \nFile Number(s), Page(s), Section(s)","Applicant accept DLC Proposal (Y/N)?","Status  i=internal\nn=no p=propose\nq=qstn\ny=yes","DLC Reviewer: \ncomment, question, proposal","DLC Reviewer:\nnotes","Action","Vlookup"]
[2,"I  ","   ","E ","    ","1)","Networking of Luminaires and Devices",null,null,null,null,null,null,null,null,2,{"$f":"IF(ISNA(MATCH(A2, Application.!A:A, 0)), \"\", MATCH(A2, Application.!A:A, 0))","v":2}]
[3,"\n \n  \n  \n  ","\n \n  \n  \n  ","\n \n  \n  \n  ","\n \n  \n  \n  ","Definition:  The capability of individual luminaires and control devices to exchange digital data with other luminaires and control devices on the system. This capability is required at the room, space, or area level, but not at the whole building level or beyond (e.g.  non-lighting systems, or the internet).",null,null,null,null,null,null,null,null,null,3,{"$f":"IF(ISNA(MATCH(A3, Application.!A:A, 0)), \"\", MATCH(A3, Application.!A:A, 0))","v":3}]
[4,"I \n ","  \n ","\n E\n ","   \n ","Can individual luminaires and control devices exchange digital data with other luminaires and control devices on the system, at the room or space level?  ",null,null,true,{"$f":"IF(I4=TRUE,\"Yes\", \"No\")","v":"Yes"},"05-Brochure, Pages 6 & 7",null,"y",null,null,4,{"$f":"IF(ISNA(MATCH(A4, Application.!A:A, 0)), \"\", MATCH(A4, Application.!A:A, 0))","v":4}]
[5," \n  \n \n "," \n  \n \n "," \n  \n \n "," \n  \n \n ","What are the size limitations of the data communication system, in terms of number of devices recommended for optimal performance? (answer with a number, or NA)",null,null,null,null,null,null,null,null,null,5,{"$f":"IF(ISNA(MATCH(A5, Application.!A:A, 0)), \"\", MATCH(A5, Application.!A:A, 0))","v":5}]
[6,"  ","i ","   "," e",null,"# of gateways per network",64,null,{"$f":"H6","v":64},"04-Lutron System Rules, Page 8, General System Rules #4 & 5",null,"y",null,null,"",{"$f":"IF(ISNA(MATCH(A6, Application.!A:A, 0)), \"\", MATCH(A6, Application.!A:A, 0))","v":6}]
[7,"  ","i ","   "," e",null,"# of devices per gateway",700,null,700,"04-Lutron System Rules, Page 8, General System Rules",null,"y",null,null,"",{"$f":"IF(ISNA(MATCH(A7, Application.!A:A, 0)), \"\", MATCH(A7, Application.!A:A, 0))","v":7}]
[8,"  ","i ","   "," e",null,"# of devices per network",{"$f":"H7*H6","v":44800},null,44800,"04-Lutron System Rules, Page 8, General System Rules",null,"y","=64*700",null,6,{"$f":"IF(ISNA(MATCH(A8, Application.!A:A, 0)), \"\", MATCH(A8, Application.!A:A, 0))","v":8}]
[9,"  ","i ","   "," e",null,"# of devices per on-premise system ",{"$f":"H8","v":44800},null,44800,"04-Lutron System Rules, Page 8, General System Rules",null,"y","=64*700",null,7,{"$f":"IF(ISNA(MATCH(A9, Application.!A:A, 0)), \"\", MATCH(A9, Application.!A:A, 0))","v":9}]
[10,"  ","i ","   "," e",null,"# of devices per cloud system",0,null,0,null,null,null,null,null,8,{"$f":"IF(ISNA(MATCH(A10, Application.!A:A, 0)), \"\", MATCH(A10, Application.!A:A, 0))","v":10}]
[11,"  ","i ","   "," e",null,"Notes if needed (e.g. aries by wired/wireless or interior/exterior?)",null,null,0,null,null,null,null,null,9,{"$f":"IF(ISNA(MATCH(A11, Application.!A:A, 0)), \"\", MATCH(A11, Application.!A:A, 0))","v":11}]
[12,"  ","i ","   "," e","What is the maximum recommended distance between components?",null,null,null,null,null,null,null,null,null,10,{"$f":"IF(ISNA(MATCH(A12, Application.!A:A, 0)), \"\", MATCH(A12, Application.!A:A, 0))","v":12}]
[13,"  ","i ","   "," e\n ",null,"Distance between wireless nodes, typical interior obstructions (feet)","30 feet for local fixture or zone controls, 71 feet to wireless hub",null,{"$f":"H13","v":"30 feet for local fixture or zone controls, 71 feet to wireless hub"},"04-Lutron System Rules, Page 8, General System Rules #4 & 5",null,"y",null,null,11,{"$f":"IF(ISNA(MATCH(A13, Application.!A:A, 0)), \"\", MATCH(A13, Application.!A:A, 0))","v":13}]
[14,"  ","i ","   "," e",null,"Distance between wireless nodes, clear line of sight (feet)","60 feet for local fixture or zone controls, 71 feet to wireless hub",null,{"$f":"H14","v":"60 feet for local fixture or zone controls, 71 feet to wireless hub"},"04-Lutron System Rules, Page 8, General System Rules #4 & 6",null,"y",null,null,12,{"$f":"IF(ISNA(MATCH(A14, Application.!A:A, 0)), \"\", MATCH(A14, Application.!A:A, 0))","v":14}]
[15,"  ","i ","   "," e",null,"Distance between wired nodes (feet)","330 ft (100 m)",null,"330 ft (100 m)","02p10: \"Wiring distance for any single link segment is 330 ft (100 m) max; use Lutron-provided or 3rd party Ethernet switches for longer distances (see page 3).\"",null,"Y",null,"02p10: \"Wiring distance for any single link segment is 330 ft (100 m) max; use Lutron-provided or 3rd party Ethernet switches for longer distances (see page 3).\"",13,{"$f":"IF(ISNA(MATCH(A15, Application.!A:A, 0)), \"\", MATCH(A15, Application.!A:A, 0))","v":15}]
[16,"  ","i ","   "," e",null,"Notes if needed",null,null,0,null,null,null,null,null,14,{"$f":"IF(ISNA(MATCH(A16, Application.!A:A, 0)), \"\", MATCH(A16, Application.!A:A, 0))","v":16}]
[17,"  \n \n","i \n \n","   \n \n"," e","Is control communication to edge devices (luminaires, sensors) wired, wireless or both?",null,"Select all that apply",null,null,null,null,null,null,null,15,{"$f":"IF(ISNA(MATCH(A17, Application.!A:A, 0)), \"\", MATCH(A17, Application.!A:A, 0))","v":17}]
[18,"  ","i ","   "," e",null,"Wired",null,false,{"$f":"IF(I18=TRUE,\"Yes\", \"No\")","v":"No"},null,null,null,null,null,16,{"$f":"IF(ISNA(MATCH(A18, Application.!A:A, 0)), \"\", MATCH(A18, Application.!A:A, 0))","v":25}]
[19,"  ","i ","   "," e",null,"Wireless",null,true,{"$f":"IF(I19=TRUE,\"Yes\", \"No\")","v":"Yes"},"05-Brochure, Pages 6 & 7",null,"y",null,null,17,{"$f":"IF(ISNA(MATCH(A19, Application.!A:A, 0)), \"\", MATCH(A19, Application.!A:A, 0))","v":26}]
[20,"  ","i\n ","   "," e","Describe briefly how networking software and firmware is upgraded. ",null,"A file can be dowloaded from Lutron website.  The GUI on the HUB will walk user through update process.",null,"A file can be dowloaded from Lutron website.  The GUI on the HUB will walk user through update process.","01-Programming Guide, Page 36, #1 thru 5",null,"y",null,null,18,{"$f":"IF(ISNA(MATCH(A20, Application.!A:A, 0)), \"\", MATCH(A20, Application.!A:A, 0))","v":27}]
{"$rows_left_out":564}
{"sheet":"Instructions.","index":1,"n_rows":0,"n_cols":0,"rows_kept":0,"cut":false,"hidden":false,"merged":[]}

{"sheet":"Application.","index":2,"n_rows":601,"n_cols":25,"rows_kept":601,"cut":false,"hidden":false,"merged":[[94,6,94,7],[314,6,314,7],[142,6,142,7],[143,6,143,7],[144,6,144,7],[146,6,146,7],[458,6,458,7],[312,6,312,7],[115,6,115,7],[116,6,116,7],[117,6,117,7],[119,6,119,7],[120,6,120,7],[123,6,123,7],[124,6,124,7],[129,6,129,7],[130,6,130,7],[131,6,131,7],[134,6,134,7],[163,6,163,7],[168,6,168,7],[140,6,140,7],[326,6,326,7],[327,6,327,7],[0,6,0,7],[2,6,2,7],[3,6,3,7],[4,6,4,7],[9,6,9,7],[14,6,14,7],[24,6,24,7],[29,6,29,7],[46,6,46,7],[17,6,17,7],[97,6,97,7],[51,6,51,7],[159,6,159,7],[107,6,107,7],[108,6,108,7],[109,6,109,7],[56,6,56,7],[135,6,135,7],[138,6,138,7],[139,6,139,7],[157,6,157,7],[158,6,158,7],[141,6,141,7],[147,6,147,7],[127,6,127,7],[128,6,128,7],[64,6,64,7],[65,6,65,7],[66,6,66,7],[67,6,67,7],[74,6,74,7],[81,6,81,7],[87,6,87,7],[93,6,93,7],[540,6,540,7],[384,6,384,7],[385,6,385,7],[386,6,386,7],[337,6,337,7],[316,6,316,7],[311,6,311,7],[255,6,255,7],[169,6,169,7],[170,6,170,7],[183,6,183,7],[184,6,184,7],[185,6,185,7],[186,6,186,7],[188,6,188,7],[189,6,189,7],[198,6,198,7],[199,6,199,7],[200,6,200,7],[205,6,205,7],[213,6,213,7],[214,6,214,7],[215,6,215,7],[222,6,222,7],[599,6,599,7],[589,6,589,7],[590,6,590,7],[592,6,592,7],[593,6,593,7],[594,6,594,7],[596,6,596,7],[541,6,541,7],[542,6,542,7],[546,6,546,7],[591,6,591,7],[549,6,549,7],[550,6,550,7],[551,6,551,7],[553,6,553,7],[558,6,558,7],[567,6,567,7],[587,6,587,7],[539,6,539,7],[256,6,256,7],[259,6,259,7],[260,6,260,7],[261,6,261,7],[271,6,271,7],[284,6,284,7],[285,6,285,7],[297,6,297,7],[299,6,299,7],[300,6,300,7],[303,6,303,7],[304,6,304,7],[305,6,305,7],[306,6,306,7],[309,6,309,7],[310,6,310,7],[531,6,531,7],[500,6,500,7],[503,6,503,7],[504,6,504,7],[505,6,505,7],[342,6,342,7],[343,6,343,7],[429,6,429,7],[525,6,525,7],[526,6,526,7],[527,6,527,7],[485,6,485,7],[467,6,467,7],[476,6,476,7],[477,6,477,7],[481,6,481,7],[484,6,484,7],[457,6,457,7],[516,6,516,7],[517,6,517,7],[466,6,466,7],[486,6,486,7],[496,6,496,7],[99,6,99,7],[191,6,191,7],[190,6,190,7],[315,6,315,7],[394,6,394,7],[395,6,395,7],[397,6,397,7],[426,6,426,7],[428,6,428,7],[340,6,340,7],[341,6,341,7],[350,6,350,7],[354,6,354,7],[359,6,359,7],[365,6,365,7],[366,6,366,7],[367,6,367,7],[371,6,371,7],[380,6,380,7],[224,6,224,7],[328,6,328,7],[353,6,353,7],[381,6,381,7]]}
["Row # V4","Row # V5","Required Interior","reported interior","Required Exterior","reported exterior","Questions",null,"V5 dataname","V5 datatype","V4 Applicant's Answer","V4 Reference","V5 answer","V5 Reference \nFile Number(s), Page(s), Section(s)","V5 T/F","V5\nConvert \nT/F to Y/N","blank","V4 Reviewer acceptance","V5 Reviewer Status  i=internal\nn=no p=propose\nq=qstn\ny=yes","V4 Question, proposal","V4 Note","V5 Reviewer Question, proposal","V5 Reviewer Note","DLC internal use, \nnot for QPL","V4 dataname"]
[2,2,"I  ","   ","E ","    ","1)","Networking of Luminaires and Devices","productId","string",null,null,null,null,null,null,{"$f":"IF(IF(ISNA(INDEX('Application V2'!A:M, MATCH(Application.!A2,'Application V2'!A:A,0),12)), \"\", INDEX('Application V2'!A:M, MATCH(Application.!A2,'Application V2'!A:A,0),12))=0, \"\", IF(ISNA(INDEX('Application V2'!A:M, MATCH(Application.!A2,'Application V2'!A:A,0),12)), \"\", INDEX('Application V2'!A:M, MATCH(Application.!A2,'Application V2'!A:A,0),12)))","v":""},null,null,null,null,null,null,null,"productId"]
[3,3,"\n \n  \n  \n  ","\n \n  \n  \n  ","\n \n  \n  \n  ","\n \n  \n  \n  ","Definition:  The capability of individual luminaires/lamps and control devices to exchange digital data with other luminaires/lamps and control devices on the system. This capability is required at the room, space, or area level, but not at the whole building level or beyond (e.g.  non-lighting systems, or the internet).",null,"blank",null,null,null,null,null,null,null,{"$f":"IF(IF(ISNA(INDEX('Application V2'!A:M, MATCH(Application.!A3,'Application V2'!A:A,0),12)), \"\", INDEX('Application V2'!A:M, MATCH(Application.!A3,'Application V2'!A:A,0),12))=0, \"\", IF(ISNA(INDEX('Application V2'!A:M, MATCH(Application.!A3,'Application V2'!A:A,0),12)), \"\", INDEX('Application V2'!A:M, MATCH(Application.!A3,'Application V2'!A:A,0),12)))","v":""},null,null,null,null,null,null,null,"blank"]
[4,4,"I \n ","  \n ","\n \n E","   \n ","Can individual luminaires and control devices exchange digital data with other luminaires and control devices on the system, at the room or space level?  ",null,"hasNetworking","boolean",null,null,null,null,false,{"$f":"IF(O4=TRUE,\"Yes\", \"No\")","v":"No"},{"$f":"IF(IF(ISNA(INDEX('Application V2'!A:M, MATCH(Application.!A4,'Application V2'!A:A,0),12)), \"\", INDEX('Application V2'!A:M, MATCH(Application.!A4,'Application V2'!A:A,0),12))=0, \"\", IF(ISNA(INDEX('Application V2'!A:M, MATCH(Application.!A4,'Application V2'!A:A,0),12)), \"\", INDEX('Application V2'!A:M, MATCH(Application.!A4,'Application V2'!A:A,0),12)))","v":""},null,null,null,null,null,null,null,"hasNetworking"]
[5,5,"I \n ",null,"\n\n  \n E"," ","What are the size limitations of the data communication system, in terms of number of edge devices recommended for optimal performance? (answer Rows 6-8 with numbers, or leave blank and explain in Row 9).  Edge devices include luminaires, switches, standalone sensors, shades, plug load controllers, etc.",null,"blank",null,null,null,null,null,null,null,{"$f":"IF(IF(ISNA(INDEX('Application V2'!A:M, MATCH(Application.!A5,'Application V2'!A:A,0),12)), \"\", INDEX('Application V2'!A:M, MATCH(Application.!A5,'Application V2'!A:A,0),12))=0, \"\", IF(ISNA(INDEX('Application V2'!A:M, MATCH(Application.!A5,'Application V2'!A:A,0),12)), \"\", INDEX('Application V2'!A:M, MATCH(Application.!A5,'Application V2'!A:A,0),12)))","v":""},null,null,null,null,null,null,null,"blank"]
[6,6,"  ","i ","   "," e",null,"# of edge devices  per network","netDevicesNum","integer",null,null,null,null,null,{"$f":"IF(ISBLANK(M6),\"\",M6)","v":""},{"$f":"IF(IF(ISNA(INDEX('Application V2'!A:M, MATCH(Application.!A6,'Application V2'!A:A,0),12)), \"\", INDEX('Application V2'!A:M, MATCH(Application.!A6,'Application V2'!A:A,0),12))=0, \"\", IF(ISNA(INDEX('Application V2'!A:M, MATCH(Application.!A6,'Application V2'!A:A,0),12)), \"\", INDEX('Application V2'!A:M, MATCH(Application.!A6,'Application V2'!A:A,0),12)))","v":""},null,null,null,null,null,null,null,"netDevicesNum"]
[7,7,"  ","i ","   "," e",null,"# of edge devices per onsite system with a central UI ","netDevicesNumOnsite ","integer",null,null,null,null,null,{"$f":"IF(ISBLANK(M7),\"\",M7)","v":""},{"$f":"IF(IF(ISNA(INDEX('Application V2'!A:M, MATCH(Application.!A7,'Application V2'!A:A,0),12)), \"\", INDEX('Application V2'!A:M, MATCH(Application.!A7,'Application V2'!A:A,0),12))=0, \"\", IF(ISNA(INDEX('Application V2'!A:M, MATCH(Application.!A7,'Application V2'!A:A,0),12)), \"\", INDEX('Application V2'!A:M, MATCH(Application.!A7,'Application V2'!A:A,0),12)))","v":""},null,null,null,null,null,null,null,"netDevicesNumOnsite "]
[8,8,"  ","i ","   "," e",null,"# of edge devices per cloud system with a central UI ","netDevicesNumCloud","integer",null,null,null,null,null,"",{"$f":"IF(IF(ISNA(INDEX('Application V2'!A:M, MATCH(Application.!A8,'Application V2'!A:A,0),12)), \"\", INDEX('Application V2'!A:M, MATCH(Application.!A8,'Application V2'!A:A,0),12))=0, \"\", IF(ISNA(INDEX('Application V2'!A:M, MATCH(Application.!A8,'Application V2'!A:A,0),12)), \"\", INDEX('Application V2'!A:M, MATCH(Application.!A8,'Application V2'!A:A,0),12)))","v":""},null,null,null,null,null,null,null,"netDevicesNumCloud"]
[9,9,"  ","i ","   "," e",null,"Notes if needed.  For instance, varies by wired/wireless or interior/exterior? If # of devices is \"Unlimited\", leave questions above blank, and write \"Unlimited\" here.","netDevicesNumText","text",null,null,null,null,null,"",{"$f":"IF(IF(ISNA(INDEX('Application V2'!A:M, MATCH(Application.!A9,'Application V2'!A:A,0),12)), \"\", INDEX('Application V2'!A:M, MATCH(Application.!A9,'Application V2'!A:A,0),12))=0, \"\", IF(ISNA(INDEX('Application V2'!A:M, MATCH(Application.!A9,'Application V2'!A:A,0),12)), \"\", INDEX('Application V2'!A:M, MATCH(Application.!A9,'Application V2'!A:A,0),12)))","v":""},null,null,null,null,null,null,null,"netDevicesNumText"]
[10,10,"  ","i ","   "," e","What is the maximum recommended distance between components?",null,"blank",null,null,null,null,null,null,null,{"$f":"IF(IF(ISNA(INDEX('Application V2'!A:M, MATCH(Application.!A10,'Application V2'!A:A,0),12)), \"\", INDEX('Application V2'!A:M, MATCH(Application.!A10,'Application V2'!A:A,0),12))=0, \"\", IF(ISNA(INDEX('Application V2'!A:M, MATCH(Application.!A10,'Application V2'!A:A,0),12)), \"\", INDEX('Application V2'!A:M, MATCH(Application.!A10,'Application V2'!A:A,0),12)))","v":""},null,null,null,null,null,null,null,"blank"]
[11,11,"  ","i ","   "," e",null,"Distance between wireless nodes, typical interior obstructions (feet)","netDistanceWirelessWithObstructionsFt","integer",null,null,null,null,null,"",{"$f":"IF(IF(ISNA(INDEX('Application V2'!A:M, MATCH(Application.!A11,'Application V2'!A:A,0),12)), \"\", INDEX('Application V2'!A:M, MATCH(Application.!A11,'Application V2'!A:A,0),12))=0, \"\", IF(ISNA(INDEX('Application V2'!A:M, MATCH(Application.!A11,'Application V2'!A:A,0),12)), \"\", INDEX('Application V2'!A:M, MATCH(Application.!A11,'Application V2'!A:A,0),12)))","v":""},null,null,null,null,null,null,null,"netDistanceWirelessWithObstructionsFt"]
[12,12,"  \n \n",null,"   \n \n"," e",null,"Distance between wireless nodes, clear line of sight (feet) (Exterior only)","netDistanceWirelessNoObstructionsFt","integer",null,null,null,null,null,"",{"$f":"IF(IF(ISNA(INDEX('Application V2'!A:M, MATCH(Application.!A12,'Application V2'!A:A,0),12)), \"\", INDEX('Application V2'!A:M, MATCH(Application.!A12,'Application V2'!A:A,0),12))=0, \"\", IF(ISNA(INDEX('Application V2'!A:M, MATCH(Application.!A12,'Application V2'!A:A,0),12)), \"\", INDEX('Application V2'!A:M, MATCH(Application.!A12,'Application V2'!A:A,0),12)))","v":""},null,null,null,null,null,null,null,"netDistanceWirelessNoObstructionsFt"]
[13,13,"  ","i ","   "," e",null,"Distance between wired nodes (feet)","netDistanceWired","integer",null,null,null,null,null,"",{"$f":"IF(IF(ISNA(INDEX('Application V2'!A:M, MATCH(Application.!A13,'Application V2'!A:A,0),12)), \"\", INDEX('Application V2'!A:M, MATCH(Application.!A13,'Application V2'!A:A,0),12))=0, \"\", IF(ISNA(INDEX('Application V2'!A:M, MATCH(Application.!A13,'Application V2'!A:A,0),12)), \"\", INDEX('Application V2'!A:M, MATCH(Application.!A13,'Application V2'!A:A,0),12)))","v":""},null,null,null,null,null,null,null,"netDistanceWired"]
[14,14,"  ","i ","   "," e",null,"Notes if needed","netDistanceNotes","text",null,null,null,null,null,"",{"$f":"IF(IF(ISNA(INDEX('Application V2'!A:M, MATCH(Application.!A14,'Application V2'!A:A,0),12)), \"\", INDEX('Application V2'!A:M, MATCH(Application.!A14,'Application V2'!A:A,0),12))=0, \"\", IF(ISNA(INDEX('Application V2'!A:M, MATCH(Application.!A14,'Application V2'!A:A,0),12)), \"\", INDEX('Application V2'!A:M, MATCH(Application.!A14,'Application V2'!A:A,0),12)))","v":""},null,null,null,null,null,null,null,"netDistanceNotes"]
[15,15,"  ","i ","   "," e","Is control communication to edge devices wired, wireless or both?",null,"netEdgeConcat","concat 16:17",null,null,"Select all that apply",null,null,null,{"$f":"IF(IF(ISNA(INDEX('Application V2'!A:M, MATCH(Application.!A15,'Application V2'!A:A,0),12)), \"\", INDEX('Application V2'!A:M, MATCH(Application.!A15,'Application V2'!A:A,0),12))=0, \"\", IF(ISNA(INDEX('Application V2'!A:M, MATCH(Application.!A15,'Application V2'!A:A,0),12)), \"\", INDEX('Application V2'!A:M, MATCH(Application.!A15,'Application V2'!A:A,0),12)))","v":""},null,null,null,null,null,null,null,"netEdgeConcat"]
[16,16,"  ","i ","   "," e",null,"Wired","netEdgeWired","boolean",null,null,null,null,false,{"$f":"IF(O16=TRUE,\"Yes\", \"No\")","v":"No"},{"$f":"IF(IF(ISNA(INDEX('Application V2'!A:M, MATCH(Application.!A16,'Application V2'!A:A,0),12)), \"\", INDEX('Application V2'!A:M, MATCH(Application.!A16,'Application V2'!A:A,0),12))=0, \"\", IF(ISNA(INDEX('Application V2'!A:M, MATCH(Application.!A16,'Application V2'!A:A,0),12)), \"\", INDEX('Application V2'!A:M, MATCH(Application.!A16,'Application V2'!A:A,0),12)))","v":""},null,null,null,null,null,null,null,"netEdgeWired"]
[17,17,"  ","i ","   "," e",null,"Wireless","netEdgeWireless","boolean",null,null,null,null,false,{"$f":"IF(O17=TRUE,\"Yes\", \"No\")","v":"No"},{"$f":"IF(IF(ISNA(INDEX('Application V2'!A:M, MATCH(Application.!A17,'Application V2'!A:A,0),12)), \"\", INDEX('Application V2'!A:M, MATCH(Application.!A17,'Application V2'!A:A,0),12))=0, \"\", IF(ISNA(INDEX('Application V2'!A:M, MATCH(Application.!A17,'Application V2'!A:A,0),12)), \"\", INDEX('Application V2'!A:M, MATCH(Application.!A17,'Application V2'!A:A,0),12)))","v":""},null,null,null,null,null,null,null,"netEdgeWireless"]
[17.100000000000001,18,null,null,null,null,"For wired communication, what wiring media type(s) does the communication between the edge devices (luminaires, sensors) and their coordinator (gateway, server, or peer) use?",null,"netwComplyConcat","concat 19:24",null,null,null,null,null,{"$f":"IF(O18=TRUE,\"Yes\", \"No\")","v":"No"}]
[17.2,19,null,"i ","   "," e",null,"Twisted Pair","netwComplyTwisted","boolean",null,null,null,null,false,"No"]
[17.3,20,null,"i ","   "," e",null,"3-Wire","netwComply3-Wire","boolean",null,null,null,null,false,"No"]
{"$rows_left_out":582}
{"sheet":"List Box Sources","index":3,"n_rows":42,"n_cols":7,"rows_kept":42,"cut":false,"hidden":true,"merged":[]}
["row of question"]
[null,null,null,null,null,null,"Check"]
[]
["V5 215","Data resolution"]
[null,"Per luminaire"]
[null,"Per zone"]
[null,"Per lighting circuit"]
[null,"Per system"]
[]
[null,null,"is question dependent?","If dependent, what should make this question appear?"]
["V5 187","scheduleLength","Column1","Column2"]
[null,"A day","y","Row 204"]
[null,"A week","y","Row 204"]
[null,"A year","y","Row 204"]
[null,"5 years","y","Row 204"]
[null,"10 years","y","Row 204"]
[null,"No limit","y","Row 204"]
[null,"Other","y","Row 204"]
[]
["V5 47","Either local or cloud server is optional","y"]
{"$rows_left_out":23}
{"sheet":"Presentation Outline.","index":4,"n_rows":0,"n_cols":0,"rows_kept":0,"cut":false,"hidden":false,"merged":[]}

{"sheet":"Notes for programming","index":5,"n_rows":0,"n_cols":0,"rows_kept":0,"cut":false,"hidden":true,"merged":[]}